"Fossies" - the Fresh Open Source Software Archive

Member "unrtf-0.21.9/config.log" (2 Jan 2015, 18490 Bytes) of package /linux/privat/unrtf-0.21.9.tar.gz:


As a special service "Fossies" has tried to format the requested text file into HTML format (style: standard) with prefixed line numbers. Alternatively you can here view or download the uninterpreted source code file.

    1 This file contains any messages produced by compilers while
    2 running configure, to aid debugging if configure makes a mistake.
    3 
    4 It was created by unrtf configure 0.21.9, which was
    5 generated by GNU Autoconf 2.69.  Invocation command line was
    6 
    7   $ ./configure 
    8 
    9 ## --------- ##
   10 ## Platform. ##
   11 ## --------- ##
   12 
   13 hostname = pylades
   14 uname -m = x86_64
   15 uname -r = 3.11.10-25-desktop
   16 uname -s = Linux
   17 uname -v = #1 SMP PREEMPT Wed Dec 17 17:57:03 UTC 2014 (8210f77)
   18 
   19 /usr/bin/uname -p = x86_64
   20 /bin/uname -X     = unknown
   21 
   22 /bin/arch              = x86_64
   23 /usr/bin/arch -k       = unknown
   24 /usr/convex/getsysinfo = unknown
   25 /usr/bin/hostinfo      = unknown
   26 /bin/machine           = unknown
   27 /usr/bin/oslevel       = unknown
   28 /bin/universe          = unknown
   29 
   30 PATH: /usr/lib64/mpi/gcc/openmpi/bin
   31 PATH: /home/daved/bin
   32 PATH: /usr/local/bin
   33 PATH: /usr/bin
   34 PATH: /bin
   35 PATH: /usr/bin/X11
   36 PATH: /usr/X11R6/bin
   37 PATH: /usr/games
   38 PATH: /opt/kde3/bin
   39 PATH: /usr/local/X11/bin
   40 PATH: /usr/local/X11/bin
   41 
   42 
   43 ## ----------- ##
   44 ## Core tests. ##
   45 ## ----------- ##
   46 
   47 configure:2066: loading site script /usr/share/site/x86_64-unknown-linux-gnu
   48 | #!/bin/sh
   49 | # Site script for configure. It is resourced via $CONFIG_SITE environment varaible.
   50 | 
   51 | # If user did not specify libdir, guess the correct target:
   52 | # Use lib64 for 64 bit bi-arch targets, keep the default for the rest.
   53 | if test "$libdir" = '${exec_prefix}/lib' ; then
   54 | 
   55 | 	ac_config_site_64bit_host=NONE
   56 | 
   57 | 	case "$host" in
   58 | 	"" )
   59 | 		# User did not specify host target.
   60 | 		# The native platform x86_64 is a bi-arch platform.
   61 | 		# Try to detect cross-compilation to inferior architecture.
   62 | 
   63 | 		# We are trying to guess 32-bit target compilation. It's not as easy as
   64 | 		# it sounds, as there is possible several intermediate combinations.
   65 | 		ac_config_site_cross_to_32bit_host=NONE
   66 | 
   67 | 		# User defined -m32 in CFLAGS or CXXFLAGS:
   68 | 		# (It's sufficient for 32-bit, but alone may cause mis-behavior of some checks.)
   69 | 		case "$CFLAGS" in
   70 | 		*-m32*)
   71 | 			ac_config_site_cross_to_32bit_host=YES
   72 | 			;;
   73 | 		esac
   74 | 		case "$CXXFLAGS" in
   75 | 		*-m32*)
   76 | 			ac_config_site_cross_to_32bit_host=YES
   77 | 			;;
   78 | 		esac
   79 | 
   80 | 		# Running with linux32:
   81 | 		# (Changes detected platform, but not the toolchain target.)
   82 | 		case "`/bin/uname -i`" in
   83 | 		x86_64 | ppc64 | s390x )
   84 | 			;;
   85 | 		* )
   86 | 			ac_config_site_cross_to_32bit_host=YES
   87 | 			;;
   88 | 		esac
   89 | 
   90 | 		if test "x$ac_config_site_cross_to_32bit_host" = xNONE; then
   91 | 			ac_config_site_64bit_host=YES
   92 | 		fi
   93 | 
   94 | 		;;
   95 | 	*x86_64* | *ppc64* | *s390x* )
   96 | 		ac_config_site_64bit_host=YES
   97 | 		;;
   98 | 	esac
   99 | 
  100 | 	if test "x$ac_config_site_64bit_host" = xYES; then
  101 | 		libdir='${exec_prefix}/lib64'
  102 | 	fi
  103 | fi
  104 | 
  105 | # If user did not specify libexecdir, set the correct target:
  106 | # Nor FHS nor openSUSE allow prefix/libexec. Let's default to prefix/lib.
  107 | 
  108 | if test "$libexecdir" = '${exec_prefix}/libexec' ; then
  109 | 	libexecdir='${exec_prefix}/lib'
  110 | fi
  111 | 
  112 | # Continue with the standard behavior of configure defined in AC_SITE_LOAD:
  113 | if test "x$prefix" != xNONE; then
  114 | 	ac_site_file1=$prefix/share/config.site
  115 | 	ac_site_file2=$prefix/etc/config.site
  116 | else
  117 | 	ac_site_file1=$ac_default_prefix/share/config.site
  118 | 	ac_site_file2=$ac_default_prefix/etc/config.site
  119 | fi
  120 | for ac_site_file in "$ac_site_file1" "$ac_site_file2"
  121 | do
  122 | 	test "x$ac_site_file" = xNONE && continue
  123 | 	if test /dev/null != "$ac_site_file" && test -r "$ac_site_file"; then
  124 | 		{ $as_echo "/usr/share/site/x86_64-unknown-linux-gnu:${as_lineno-$LINENO}: loading site script $ac_site_file" >&5
  125 | $as_echo "/usr/share/site/x86_64-unknown-linux-gnu: loading site script $ac_site_file" >&6;}
  126 | 		sed 's/^/| /' "$ac_site_file" >&5
  127 | 		. "$ac_site_file" \
  128 | 			|| { { $as_echo "/usr/share/site/x86_64-unknown-linux-gnu:${as_lineno-$LINENO}: error: in \`$ac_pwd':" >&5
  129 | $as_echo "/usr/share/site/x86_64-unknown-linux-gnu: error: in \`$ac_pwd':" >&2;}
  130 | as_fn_error $? "failed to load site script $ac_site_file
  131 | See \`config.log' for more details" "$LINENO" 5; }
  132 | 	fi
  133 | done
  134 configure:2213: checking for a BSD-compatible install
  135 configure:2281: result: /usr/bin/install -c
  136 configure:2292: checking whether build environment is sane
  137 configure:2347: result: yes
  138 configure:2498: checking for a thread-safe mkdir -p
  139 configure:2537: result: /usr/bin/mkdir -p
  140 configure:2544: checking for gawk
  141 configure:2560: found /usr/bin/gawk
  142 configure:2571: result: gawk
  143 configure:2582: checking whether make sets $(MAKE)
  144 configure:2604: result: yes
  145 configure:2633: checking whether make supports nested variables
  146 configure:2650: result: yes
  147 configure:2747: checking whether to enable maintainer-specific portions of Makefiles
  148 configure:2756: result: no
  149 configure:2819: checking for gcc
  150 configure:2835: found /usr/bin/gcc
  151 configure:2846: result: gcc
  152 configure:3075: checking for C compiler version
  153 configure:3084: gcc --version >&5
  154 gcc (SUSE Linux) 4.8.1 20130909 [gcc-4_8-branch revision 202388]
  155 Copyright (C) 2013 Free Software Foundation, Inc.
  156 This is free software; see the source for copying conditions.  There is NO
  157 warranty; not even for MERCHANTABILITY or FITNESS FOR A PARTICULAR PURPOSE.
  158 
  159 configure:3095: $? = 0
  160 configure:3084: gcc -v >&5
  161 Using built-in specs.
  162 COLLECT_GCC=gcc
  163 COLLECT_LTO_WRAPPER=/usr/lib64/gcc/x86_64-suse-linux/4.8/lto-wrapper
  164 Target: x86_64-suse-linux
  165 Configured with: ../configure --prefix=/usr --infodir=/usr/share/info --mandir=/usr/share/man --libdir=/usr/lib64 --libexecdir=/usr/lib64 --enable-languages=c,c++,objc,fortran,obj-c++,java,ada --enable-checking=release --with-gxx-include-dir=/usr/include/c++/4.8 --enable-ssp --disable-libssp --disable-plugin --with-bugurl=http://bugs.opensuse.org/ --with-pkgversion='SUSE Linux' --disable-libgcj --disable-libmudflap --with-slibdir=/lib64 --with-system-zlib --enable-__cxa_atexit --enable-libstdcxx-allocator=new --disable-libstdcxx-pch --enable-version-specific-runtime-libs --enable-linker-build-id --program-suffix=-4.8 --enable-linux-futex --without-system-libunwind --with-arch-32=i586 --with-tune=generic --build=x86_64-suse-linux
  166 Thread model: posix
  167 gcc version 4.8.1 20130909 [gcc-4_8-branch revision 202388] (SUSE Linux) 
  168 configure:3095: $? = 0
  169 configure:3084: gcc -V >&5
  170 gcc: error: unrecognized command line option '-V'
  171 gcc: fatal error: no input files
  172 compilation terminated.
  173 configure:3095: $? = 1
  174 configure:3084: gcc -qversion >&5
  175 gcc: error: unrecognized command line option '-qversion'
  176 gcc: fatal error: no input files
  177 compilation terminated.
  178 configure:3095: $? = 1
  179 configure:3115: checking whether the C compiler works
  180 configure:3137: gcc    conftest.c  >&5
  181 configure:3141: $? = 0
  182 configure:3189: result: yes
  183 configure:3192: checking for C compiler default output file name
  184 configure:3194: result: a.out
  185 configure:3200: checking for suffix of executables
  186 configure:3207: gcc -o conftest    conftest.c  >&5
  187 configure:3211: $? = 0
  188 configure:3233: result: 
  189 configure:3255: checking whether we are cross compiling
  190 configure:3263: gcc -o conftest    conftest.c  >&5
  191 configure:3267: $? = 0
  192 configure:3274: ./conftest
  193 configure:3278: $? = 0
  194 configure:3293: result: no
  195 configure:3298: checking for suffix of object files
  196 configure:3320: gcc -c   conftest.c >&5
  197 configure:3324: $? = 0
  198 configure:3345: result: o
  199 configure:3349: checking whether we are using the GNU C compiler
  200 configure:3368: gcc -c   conftest.c >&5
  201 configure:3368: $? = 0
  202 configure:3377: result: yes
  203 configure:3386: checking whether gcc accepts -g
  204 configure:3406: gcc -c -g  conftest.c >&5
  205 configure:3406: $? = 0
  206 configure:3447: result: yes
  207 configure:3464: checking for gcc option to accept ISO C89
  208 configure:3527: gcc  -c -g -O2  conftest.c >&5
  209 configure:3527: $? = 0
  210 configure:3540: result: none needed
  211 configure:3571: checking for style of include used by make
  212 configure:3599: result: GNU
  213 configure:3625: checking dependency style of gcc
  214 configure:3736: result: gcc3
  215 configure:3760: checking how to run the C preprocessor
  216 configure:3791: gcc -E  conftest.c
  217 configure:3791: $? = 0
  218 configure:3805: gcc -E  conftest.c
  219 conftest.c:11:28: fatal error: ac_nonexistent.h: No such file or directory
  220  #include <ac_nonexistent.h>
  221                             ^
  222 compilation terminated.
  223 configure:3805: $? = 1
  224 configure: failed program was:
  225 | /* confdefs.h */
  226 | #define PACKAGE_NAME "unrtf"
  227 | #define PACKAGE_TARNAME "unrtf"
  228 | #define PACKAGE_VERSION "0.21.9"
  229 | #define PACKAGE_STRING "unrtf 0.21.9"
  230 | #define PACKAGE_BUGREPORT "bug-unrtf@gnu.org"
  231 | #define PACKAGE_URL ""
  232 | #define PACKAGE "unrtf"
  233 | #define VERSION "0.21.9"
  234 | /* end confdefs.h.  */
  235 | #include <ac_nonexistent.h>
  236 configure:3830: result: gcc -E
  237 configure:3850: gcc -E  conftest.c
  238 configure:3850: $? = 0
  239 configure:3864: gcc -E  conftest.c
  240 conftest.c:11:28: fatal error: ac_nonexistent.h: No such file or directory
  241  #include <ac_nonexistent.h>
  242                             ^
  243 compilation terminated.
  244 configure:3864: $? = 1
  245 configure: failed program was:
  246 | /* confdefs.h */
  247 | #define PACKAGE_NAME "unrtf"
  248 | #define PACKAGE_TARNAME "unrtf"
  249 | #define PACKAGE_VERSION "0.21.9"
  250 | #define PACKAGE_STRING "unrtf 0.21.9"
  251 | #define PACKAGE_BUGREPORT "bug-unrtf@gnu.org"
  252 | #define PACKAGE_URL ""
  253 | #define PACKAGE "unrtf"
  254 | #define VERSION "0.21.9"
  255 | /* end confdefs.h.  */
  256 | #include <ac_nonexistent.h>
  257 configure:3893: checking for grep that handles long lines and -e
  258 configure:3951: result: /usr/bin/grep
  259 configure:3956: checking for egrep
  260 configure:4018: result: /usr/bin/grep -E
  261 configure:4023: checking for ANSI C header files
  262 configure:4043: gcc -c -g -O2  conftest.c >&5
  263 configure:4043: $? = 0
  264 configure:4116: gcc -o conftest -g -O2   conftest.c  >&5
  265 configure:4116: $? = 0
  266 configure:4116: ./conftest
  267 configure:4116: $? = 0
  268 configure:4127: result: yes
  269 configure:4143: checking for sys/types.h
  270 configure:4143: gcc -c -g -O2  conftest.c >&5
  271 configure:4143: $? = 0
  272 configure:4143: result: yes
  273 configure:4143: checking for sys/stat.h
  274 configure:4143: gcc -c -g -O2  conftest.c >&5
  275 configure:4143: $? = 0
  276 configure:4143: result: yes
  277 configure:4143: checking for stdlib.h
  278 configure:4143: gcc -c -g -O2  conftest.c >&5
  279 configure:4143: $? = 0
  280 configure:4143: result: yes
  281 configure:4143: checking for string.h
  282 configure:4143: gcc -c -g -O2  conftest.c >&5
  283 configure:4143: $? = 0
  284 configure:4143: result: yes
  285 configure:4143: checking for memory.h
  286 configure:4143: gcc -c -g -O2  conftest.c >&5
  287 configure:4143: $? = 0
  288 configure:4143: result: yes
  289 configure:4143: checking for strings.h
  290 configure:4143: gcc -c -g -O2  conftest.c >&5
  291 configure:4143: $? = 0
  292 configure:4143: result: yes
  293 configure:4143: checking for inttypes.h
  294 configure:4143: gcc -c -g -O2  conftest.c >&5
  295 configure:4143: $? = 0
  296 configure:4143: result: yes
  297 configure:4143: checking for stdint.h
  298 configure:4143: gcc -c -g -O2  conftest.c >&5
  299 configure:4143: $? = 0
  300 configure:4143: result: yes
  301 configure:4143: checking for unistd.h
  302 configure:4143: gcc -c -g -O2  conftest.c >&5
  303 configure:4143: $? = 0
  304 configure:4143: result: yes
  305 configure:4158: checking for stdlib.h
  306 configure:4158: result: yes
  307 configure:4158: checking stdio.h usability
  308 configure:4158: gcc -c -g -O2  conftest.c >&5
  309 configure:4158: $? = 0
  310 configure:4158: result: yes
  311 configure:4158: checking stdio.h presence
  312 configure:4158: gcc -E  conftest.c
  313 configure:4158: $? = 0
  314 configure:4158: result: yes
  315 configure:4158: checking for stdio.h
  316 configure:4158: result: yes
  317 configure:4158: checking ctype.h usability
  318 configure:4158: gcc -c -g -O2  conftest.c >&5
  319 configure:4158: $? = 0
  320 configure:4158: result: yes
  321 configure:4158: checking ctype.h presence
  322 configure:4158: gcc -E  conftest.c
  323 configure:4158: $? = 0
  324 configure:4158: result: yes
  325 configure:4158: checking for ctype.h
  326 configure:4158: result: yes
  327 configure:4158: checking for string.h
  328 configure:4158: result: yes
  329 configure:4174: checking for stdlib.h
  330 configure:4174: result: yes
  331 configure:4184: checking for GNU libc compatible malloc
  332 configure:4208: gcc -o conftest -g -O2   conftest.c  >&5
  333 configure:4208: $? = 0
  334 configure:4208: ./conftest
  335 configure:4208: $? = 0
  336 configure:4218: result: yes
  337 configure:4242: checking for memset
  338 configure:4242: gcc -o conftest -g -O2   conftest.c  >&5
  339 conftest.c:50:6: warning: conflicting types for built-in function 'memset' [enabled by default]
  340  char memset ();
  341       ^
  342 configure:4242: $? = 0
  343 configure:4242: result: yes
  344 configure:4242: checking for strchr
  345 configure:4242: gcc -o conftest -g -O2   conftest.c  >&5
  346 conftest.c:51:6: warning: conflicting types for built-in function 'strchr' [enabled by default]
  347  char strchr ();
  348       ^
  349 configure:4242: $? = 0
  350 configure:4242: result: yes
  351 configure:4242: checking for strstr
  352 configure:4242: gcc -o conftest -g -O2   conftest.c  >&5
  353 conftest.c:52:6: warning: conflicting types for built-in function 'strstr' [enabled by default]
  354  char strstr ();
  355       ^
  356 configure:4242: $? = 0
  357 configure:4242: result: yes
  358 configure:4256: checking build system type
  359 configure:4270: result: x86_64-suse-linux-gnu
  360 configure:4290: checking host system type
  361 configure:4303: result: x86_64-suse-linux-gnu
  362 configure:4443: checking that generated files are newer than configure
  363 configure:4449: result: done
  364 configure:4476: creating ./config.status
  365 
  366 ## ---------------------- ##
  367 ## Running config.status. ##
  368 ## ---------------------- ##
  369 
  370 This file was extended by unrtf config.status 0.21.9, which was
  371 generated by GNU Autoconf 2.69.  Invocation command line was
  372 
  373   CONFIG_FILES    = 
  374   CONFIG_HEADERS  = 
  375   CONFIG_LINKS    = 
  376   CONFIG_COMMANDS = 
  377   $ ./config.status 
  378 
  379 on pylades
  380 
  381 config.status:877: creating Makefile
  382 config.status:877: creating doc/Makefile
  383 config.status:877: creating outputs/Makefile
  384 config.status:877: creating patches/Makefile
  385 config.status:877: creating src/Makefile
  386 config.status:877: creating tests/Makefile
  387 config.status:877: creating config.h
  388 config.status:1106: executing depfiles commands
  389 
  390 ## ---------------- ##
  391 ## Cache variables. ##
  392 ## ---------------- ##
  393 
  394 ac_cv_build=x86_64-suse-linux-gnu
  395 ac_cv_c_compiler_gnu=yes
  396 ac_cv_env_CC_set=
  397 ac_cv_env_CC_value=
  398 ac_cv_env_CFLAGS_set=
  399 ac_cv_env_CFLAGS_value=
  400 ac_cv_env_CPPFLAGS_set=
  401 ac_cv_env_CPPFLAGS_value=
  402 ac_cv_env_CPP_set=
  403 ac_cv_env_CPP_value=
  404 ac_cv_env_LDFLAGS_set=
  405 ac_cv_env_LDFLAGS_value=
  406 ac_cv_env_LIBS_set=
  407 ac_cv_env_LIBS_value=
  408 ac_cv_env_build_alias_set=
  409 ac_cv_env_build_alias_value=
  410 ac_cv_env_host_alias_set=
  411 ac_cv_env_host_alias_value=
  412 ac_cv_env_target_alias_set=
  413 ac_cv_env_target_alias_value=
  414 ac_cv_func_malloc_0_nonnull=yes
  415 ac_cv_func_memset=yes
  416 ac_cv_func_strchr=yes
  417 ac_cv_func_strstr=yes
  418 ac_cv_header_ctype_h=yes
  419 ac_cv_header_inttypes_h=yes
  420 ac_cv_header_memory_h=yes
  421 ac_cv_header_stdc=yes
  422 ac_cv_header_stdint_h=yes
  423 ac_cv_header_stdio_h=yes
  424 ac_cv_header_stdlib_h=yes
  425 ac_cv_header_string_h=yes
  426 ac_cv_header_strings_h=yes
  427 ac_cv_header_sys_stat_h=yes
  428 ac_cv_header_sys_types_h=yes
  429 ac_cv_header_unistd_h=yes
  430 ac_cv_host=x86_64-suse-linux-gnu
  431 ac_cv_objext=o
  432 ac_cv_path_EGREP='/usr/bin/grep -E'
  433 ac_cv_path_GREP=/usr/bin/grep
  434 ac_cv_path_install='/usr/bin/install -c'
  435 ac_cv_path_mkdir=/usr/bin/mkdir
  436 ac_cv_prog_AWK=gawk
  437 ac_cv_prog_CPP='gcc -E'
  438 ac_cv_prog_ac_ct_CC=gcc
  439 ac_cv_prog_cc_c89=
  440 ac_cv_prog_cc_g=yes
  441 ac_cv_prog_make_make_set=yes
  442 am_cv_CC_dependencies_compiler_type=gcc3
  443 am_cv_make_support_nested_variables=yes
  444 
  445 ## ----------------- ##
  446 ## Output variables. ##
  447 ## ----------------- ##
  448 
  449 ACLOCAL='${SHELL} /src/local/cmd/unrtf/hg/unrtf/config/missing aclocal-1.13'
  450 AMDEPBACKSLASH='\'
  451 AMDEP_FALSE='#'
  452 AMDEP_TRUE=''
  453 AMTAR='$${TAR-tar}'
  454 AM_BACKSLASH='\'
  455 AM_DEFAULT_V='$(AM_DEFAULT_VERBOSITY)'
  456 AM_DEFAULT_VERBOSITY='1'
  457 AM_V='$(V)'
  458 AUTOCONF='${SHELL} /src/local/cmd/unrtf/hg/unrtf/config/missing autoconf'
  459 AUTOHEADER='${SHELL} /src/local/cmd/unrtf/hg/unrtf/config/missing autoheader'
  460 AUTOMAKE='${SHELL} /src/local/cmd/unrtf/hg/unrtf/config/missing automake-1.13'
  461 AWK='gawk'
  462 CC='gcc'
  463 CCDEPMODE='depmode=gcc3'
  464 CFLAGS='-g -O2'
  465 CPP='gcc -E'
  466 CPPFLAGS=''
  467 CYGPATH_W='echo'
  468 DEFS='-DHAVE_CONFIG_H'
  469 DEPDIR='.deps'
  470 ECHO_C=''
  471 ECHO_N='-n'
  472 ECHO_T=''
  473 EGREP='/usr/bin/grep -E'
  474 EXEEXT=''
  475 GREP='/usr/bin/grep'
  476 INSTALL_DATA='${INSTALL} -m 644'
  477 INSTALL_PROGRAM='${INSTALL}'
  478 INSTALL_SCRIPT='${INSTALL}'
  479 INSTALL_STRIP_PROGRAM='$(install_sh) -c -s'
  480 LDFLAGS=''
  481 LIBOBJS=''
  482 LIBS=''
  483 LTLIBOBJS=''
  484 MAINT='#'
  485 MAINTAINER_MODE_FALSE=''
  486 MAINTAINER_MODE_TRUE='#'
  487 MAKEINFO='${SHELL} /src/local/cmd/unrtf/hg/unrtf/config/missing makeinfo'
  488 MKDIR_P='/usr/bin/mkdir -p'
  489 OBJEXT='o'
  490 PACKAGE='unrtf'
  491 PACKAGE_BUGREPORT='bug-unrtf@gnu.org'
  492 PACKAGE_NAME='unrtf'
  493 PACKAGE_STRING='unrtf 0.21.9'
  494 PACKAGE_TARNAME='unrtf'
  495 PACKAGE_URL=''
  496 PACKAGE_VERSION='0.21.9'
  497 PATH_SEPARATOR=':'
  498 SET_MAKE=''
  499 SHELL='/bin/sh'
  500 STRIP=''
  501 VERSION='0.21.9'
  502 ac_ct_CC='gcc'
  503 am__EXEEXT_FALSE=''
  504 am__EXEEXT_TRUE='#'
  505 am__fastdepCC_FALSE='#'
  506 am__fastdepCC_TRUE=''
  507 am__include='include'
  508 am__isrc=''
  509 am__leading_dot='.'
  510 am__nodep='_no'
  511 am__quote=''
  512 am__tar='$${TAR-tar} chof - "$$tardir"'
  513 am__untar='$${TAR-tar} xf -'
  514 bindir='${exec_prefix}/bin'
  515 build='x86_64-suse-linux-gnu'
  516 build_alias=''
  517 build_cpu='x86_64'
  518 build_os='linux-gnu'
  519 build_vendor='suse'
  520 datadir='${datarootdir}'
  521 datarootdir='${prefix}/share'
  522 docdir='${datarootdir}/doc/${PACKAGE_TARNAME}'
  523 dvidir='${docdir}'
  524 exec_prefix='${prefix}'
  525 host='x86_64-suse-linux-gnu'
  526 host_alias=''
  527 host_cpu='x86_64'
  528 host_os='linux-gnu'
  529 host_vendor='suse'
  530 htmldir='${docdir}'
  531 includedir='${prefix}/include'
  532 infodir='${datarootdir}/info'
  533 install_sh='${SHELL} /src/local/cmd/unrtf/hg/unrtf/config/install-sh'
  534 libdir='${exec_prefix}/lib64'
  535 libexecdir='${exec_prefix}/lib'
  536 localedir='${datarootdir}/locale'
  537 localstatedir='${prefix}/var'
  538 mandir='${datarootdir}/man'
  539 mkdir_p='$(MKDIR_P)'
  540 oldincludedir='/usr/include'
  541 pdfdir='${docdir}'
  542 prefix='/usr/local'
  543 program_transform_name='s,x,x,'
  544 psdir='${docdir}'
  545 sbindir='${exec_prefix}/sbin'
  546 sharedstatedir='${prefix}/com'
  547 sysconfdir='${prefix}/etc'
  548 target_alias=''
  549 
  550 ## ----------- ##
  551 ## confdefs.h. ##
  552 ## ----------- ##
  553 
  554 /* confdefs.h */
  555 #define PACKAGE_NAME "unrtf"
  556 #define PACKAGE_TARNAME "unrtf"
  557 #define PACKAGE_VERSION "0.21.9"
  558 #define PACKAGE_STRING "unrtf 0.21.9"
  559 #define PACKAGE_BUGREPORT "bug-unrtf@gnu.org"
  560 #define PACKAGE_URL ""
  561 #define PACKAGE "unrtf"
  562 #define VERSION "0.21.9"
  563 #define STDC_HEADERS 1
  564 #define HAVE_SYS_TYPES_H 1
  565 #define HAVE_SYS_STAT_H 1
  566 #define HAVE_STDLIB_H 1
  567 #define HAVE_STRING_H 1
  568 #define HAVE_MEMORY_H 1
  569 #define HAVE_STRINGS_H 1
  570 #define HAVE_INTTYPES_H 1
  571 #define HAVE_STDINT_H 1
  572 #define HAVE_UNISTD_H 1
  573 #define HAVE_STDLIB_H 1
  574 #define HAVE_STDIO_H 1
  575 #define HAVE_CTYPE_H 1
  576 #define HAVE_STRING_H 1
  577 #define HAVE_STDLIB_H 1
  578 #define HAVE_MALLOC 1
  579 #define HAVE_MEMSET 1
  580 #define HAVE_STRCHR 1
  581 #define HAVE_STRSTR 1
  582 
  583 configure: exit 0