"Fossies" - the Fresh Open Source Software Archive

Member "libmcrypt-2.5.8/config.log" (19 Feb 2007, 69045 Bytes) of package /linux/privat/old/libmcrypt-2.5.8.tar.gz:


As a special service "Fossies" has tried to format the requested text file into HTML format (style: standard) with prefixed line numbers. Alternatively you can here view or download the uninterpreted source code file.

    1 This file contains any messages produced by compilers while
    2 running configure, to aid debugging if configure makes a mistake.
    3 
    4 It was created by configure, which was
    5 generated by GNU Autoconf 2.59.  Invocation command line was
    6 
    7   $ ./configure --prefix=/usr --enable-static --enable-shared
    8 
    9 ## --------- ##
   10 ## Platform. ##
   11 ## --------- ##
   12 
   13 hostname = localhost.localdomain
   14 uname -m = i686
   15 uname -r = 2.6.19-1.2895.fc6
   16 uname -s = Linux
   17 uname -v = #1 SMP Wed Jan 10 19:28:18 EST 2007
   18 
   19 /usr/bin/uname -p = unknown
   20 /bin/uname -X     = unknown
   21 
   22 /bin/arch              = i686
   23 /usr/bin/arch -k       = unknown
   24 /usr/convex/getsysinfo = unknown
   25 hostinfo               = unknown
   26 /bin/machine           = unknown
   27 /usr/bin/oslevel       = unknown
   28 /bin/universe          = unknown
   29 
   30 PATH: /usr/lib/qt-3.3/bin
   31 PATH: /usr/kerberos/sbin
   32 PATH: /usr/kerberos/bin
   33 PATH: /usr/lib/ccache
   34 PATH: /usr/local/sbin
   35 PATH: /usr/local/bin
   36 PATH: /sbin
   37 PATH: /bin
   38 PATH: /usr/sbin
   39 PATH: /usr/bin
   40 PATH: /usr/X11R6/bin
   41 PATH: /root/bin
   42 
   43 
   44 ## ----------- ##
   45 ## Core tests. ##
   46 ## ----------- ##
   47 
   48 configure:1546: checking build system type
   49 configure:1564: result: i686-redhat-linux-gnu
   50 configure:1572: checking host system type
   51 configure:1586: result: i686-redhat-linux-gnu
   52 configure:1594: checking target system type
   53 configure:1608: result: i686-redhat-linux-gnu
   54 configure:1636: checking for a BSD-compatible install
   55 configure:1691: result: /usr/bin/install -c
   56 configure:1702: checking whether build environment is sane
   57 configure:1745: result: yes
   58 configure:1810: checking for gawk
   59 configure:1826: found /bin/gawk
   60 configure:1836: result: gawk
   61 configure:1846: checking whether make sets $(MAKE)
   62 configure:1866: result: yes
   63 configure:2037: checking whether to enable maintainer-specific portions of Makefiles
   64 configure:2046: result: no
   65 configure:2062: checking whether make sets $(MAKE)
   66 configure:2082: result: yes
   67 configure:2144: checking for g++
   68 configure:2160: found /usr/lib/ccache/g++
   69 configure:2170: result: g++
   70 configure:2186: checking for C++ compiler version
   71 configure:2189: g++ --version </dev/null >&5
   72 g++ (GCC) 4.1.1 20070105 (Red Hat 4.1.1-51)
   73 Copyright (C) 2006 Free Software Foundation, Inc.
   74 This is free software; see the source for copying conditions.  There is NO
   75 warranty; not even for MERCHANTABILITY or FITNESS FOR A PARTICULAR PURPOSE.
   76 
   77 configure:2192: $? = 0
   78 configure:2194: g++ -v </dev/null >&5
   79 Using built-in specs.
   80 Target: i386-redhat-linux
   81 Configured with: ../configure --prefix=/usr --mandir=/usr/share/man --infodir=/usr/share/info --enable-shared --enable-threads=posix --enable-checking=release --with-system-zlib --enable-__cxa_atexit --disable-libunwind-exceptions --enable-libgcj-multifile --enable-languages=c,c++,objc,obj-c++,java,fortran,ada --enable-java-awt=gtk --disable-dssi --enable-plugin --with-java-home=/usr/lib/jvm/java-1.4.2-gcj-1.4.2.0/jre --with-cpu=generic --host=i386-redhat-linux
   82 Thread model: posix
   83 gcc version 4.1.1 20070105 (Red Hat 4.1.1-51)
   84 configure:2197: $? = 0
   85 configure:2199: g++ -V </dev/null >&5
   86 g++: '-V' option must have argument
   87 configure:2202: $? = 1
   88 configure:2225: checking for C++ compiler default output file name
   89 configure:2228: g++    conftest.cc  >&5
   90 configure:2231: $? = 0
   91 configure:2277: result: a.out
   92 configure:2282: checking whether the C++ compiler works
   93 configure:2288: ./a.out
   94 configure:2291: $? = 0
   95 configure:2308: result: yes
   96 configure:2315: checking whether we are cross compiling
   97 configure:2317: result: no
   98 configure:2320: checking for suffix of executables
   99 configure:2322: g++ -o conftest    conftest.cc  >&5
  100 configure:2325: $? = 0
  101 configure:2350: result: 
  102 configure:2356: checking for suffix of object files
  103 configure:2377: g++ -c   conftest.cc >&5
  104 configure:2380: $? = 0
  105 configure:2402: result: o
  106 configure:2406: checking whether we are using the GNU C++ compiler
  107 configure:2430: g++ -c   conftest.cc >&5
  108 configure:2436: $? = 0
  109 configure:2440: test -z 
  110 			 || test ! -s conftest.err
  111 configure:2443: $? = 0
  112 configure:2446: test -s conftest.o
  113 configure:2449: $? = 0
  114 configure:2462: result: yes
  115 configure:2468: checking whether g++ accepts -g
  116 configure:2489: g++ -c -g  conftest.cc >&5
  117 configure:2495: $? = 0
  118 configure:2499: test -z 
  119 			 || test ! -s conftest.err
  120 configure:2502: $? = 0
  121 configure:2505: test -s conftest.o
  122 configure:2508: $? = 0
  123 configure:2519: result: yes
  124 configure:2561: g++ -c -g -O2  conftest.cc >&5
  125 configure:2567: $? = 0
  126 configure:2571: test -z 
  127 			 || test ! -s conftest.err
  128 configure:2574: $? = 0
  129 configure:2577: test -s conftest.o
  130 configure:2580: $? = 0
  131 configure:2606: g++ -c -g -O2  conftest.cc >&5
  132 conftest.cc: In function 'int main()':
  133 conftest.cc:15: error: 'exit' was not declared in this scope
  134 configure:2612: $? = 1
  135 configure: failed program was:
  136 | /* confdefs.h.  */
  137 | 
  138 | #define PACKAGE_NAME ""
  139 | #define PACKAGE_TARNAME ""
  140 | #define PACKAGE_VERSION ""
  141 | #define PACKAGE_STRING ""
  142 | #define PACKAGE_BUGREPORT ""
  143 | #define PACKAGE "libmcrypt"
  144 | #define VERSION "2.5.8"
  145 | /* end confdefs.h.  */
  146 | 
  147 | int
  148 | main ()
  149 | {
  150 | exit (42);
  151 |   ;
  152 |   return 0;
  153 | }
  154 configure:2561: g++ -c -g -O2  conftest.cc >&5
  155 configure:2567: $? = 0
  156 configure:2571: test -z 
  157 			 || test ! -s conftest.err
  158 configure:2574: $? = 0
  159 configure:2577: test -s conftest.o
  160 configure:2580: $? = 0
  161 configure:2606: g++ -c -g -O2  conftest.cc >&5
  162 configure:2612: $? = 0
  163 configure:2616: test -z 
  164 			 || test ! -s conftest.err
  165 configure:2619: $? = 0
  166 configure:2622: test -s conftest.o
  167 configure:2625: $? = 0
  168 configure:2659: checking for style of include used by make
  169 configure:2687: result: GNU
  170 configure:2715: checking dependency style of g++
  171 configure:2805: result: gcc3
  172 configure:2868: checking for gcc
  173 configure:2884: found /usr/lib/ccache/gcc
  174 configure:2894: result: gcc
  175 configure:3138: checking for C compiler version
  176 configure:3141: gcc --version </dev/null >&5
  177 gcc (GCC) 4.1.1 20070105 (Red Hat 4.1.1-51)
  178 Copyright (C) 2006 Free Software Foundation, Inc.
  179 This is free software; see the source for copying conditions.  There is NO
  180 warranty; not even for MERCHANTABILITY or FITNESS FOR A PARTICULAR PURPOSE.
  181 
  182 configure:3144: $? = 0
  183 configure:3146: gcc -v </dev/null >&5
  184 Using built-in specs.
  185 Target: i386-redhat-linux
  186 Configured with: ../configure --prefix=/usr --mandir=/usr/share/man --infodir=/usr/share/info --enable-shared --enable-threads=posix --enable-checking=release --with-system-zlib --enable-__cxa_atexit --disable-libunwind-exceptions --enable-libgcj-multifile --enable-languages=c,c++,objc,obj-c++,java,fortran,ada --enable-java-awt=gtk --disable-dssi --enable-plugin --with-java-home=/usr/lib/jvm/java-1.4.2-gcj-1.4.2.0/jre --with-cpu=generic --host=i386-redhat-linux
  187 Thread model: posix
  188 gcc version 4.1.1 20070105 (Red Hat 4.1.1-51)
  189 configure:3149: $? = 0
  190 configure:3151: gcc -V </dev/null >&5
  191 gcc: '-V' option must have argument
  192 configure:3154: $? = 1
  193 configure:3157: checking whether we are using the GNU C compiler
  194 configure:3181: gcc -c   conftest.c >&5
  195 configure:3187: $? = 0
  196 configure:3191: test -z 
  197 			 || test ! -s conftest.err
  198 configure:3194: $? = 0
  199 configure:3197: test -s conftest.o
  200 configure:3200: $? = 0
  201 configure:3213: result: yes
  202 configure:3219: checking whether gcc accepts -g
  203 configure:3240: gcc -c -g  conftest.c >&5
  204 configure:3246: $? = 0
  205 configure:3250: test -z 
  206 			 || test ! -s conftest.err
  207 configure:3253: $? = 0
  208 configure:3256: test -s conftest.o
  209 configure:3259: $? = 0
  210 configure:3270: result: yes
  211 configure:3287: checking for gcc option to accept ANSI C
  212 configure:3357: gcc  -c -g -O2  conftest.c >&5
  213 configure:3363: $? = 0
  214 configure:3367: test -z 
  215 			 || test ! -s conftest.err
  216 configure:3370: $? = 0
  217 configure:3373: test -s conftest.o
  218 configure:3376: $? = 0
  219 configure:3394: result: none needed
  220 configure:3412: gcc -c -g -O2  conftest.c >&5
  221 conftest.c:2: error: expected '=', ',', ';', 'asm' or '__attribute__' before 'me'
  222 configure:3418: $? = 1
  223 configure: failed program was:
  224 | #ifndef __cplusplus
  225 |   choke me
  226 | #endif
  227 configure:3553: checking dependency style of gcc
  228 configure:3643: result: gcc3
  229 configure:3665: checking how to run the C preprocessor
  230 configure:3700: gcc -E  conftest.c
  231 configure:3706: $? = 0
  232 configure:3738: gcc -E  conftest.c
  233 conftest.c:14:28: error: ac_nonexistent.h: No such file or directory
  234 configure:3744: $? = 1
  235 configure: failed program was:
  236 | /* confdefs.h.  */
  237 | 
  238 | #define PACKAGE_NAME ""
  239 | #define PACKAGE_TARNAME ""
  240 | #define PACKAGE_VERSION ""
  241 | #define PACKAGE_STRING ""
  242 | #define PACKAGE_BUGREPORT ""
  243 | #define PACKAGE "libmcrypt"
  244 | #define VERSION "2.5.8"
  245 | #ifdef __cplusplus
  246 | extern "C" void std::exit (int) throw (); using std::exit;
  247 | #endif
  248 | /* end confdefs.h.  */
  249 | #include <ac_nonexistent.h>
  250 configure:3783: result: gcc -E
  251 configure:3807: gcc -E  conftest.c
  252 configure:3813: $? = 0
  253 configure:3845: gcc -E  conftest.c
  254 conftest.c:14:28: error: ac_nonexistent.h: No such file or directory
  255 configure:3851: $? = 1
  256 configure: failed program was:
  257 | /* confdefs.h.  */
  258 | 
  259 | #define PACKAGE_NAME ""
  260 | #define PACKAGE_TARNAME ""
  261 | #define PACKAGE_VERSION ""
  262 | #define PACKAGE_STRING ""
  263 | #define PACKAGE_BUGREPORT ""
  264 | #define PACKAGE "libmcrypt"
  265 | #define VERSION "2.5.8"
  266 | #ifdef __cplusplus
  267 | extern "C" void std::exit (int) throw (); using std::exit;
  268 | #endif
  269 | /* end confdefs.h.  */
  270 | #include <ac_nonexistent.h>
  271 configure:3907: checking for a BSD-compatible install
  272 configure:3962: result: /usr/bin/install -c
  273 configure:3973: checking whether ln -s works
  274 configure:3977: result: yes
  275 configure:3984: checking whether make sets $(MAKE)
  276 configure:4004: result: yes
  277 configure:4054: checking for a BSD-compatible install
  278 configure:4109: result: /usr/bin/install -c
  279 configure:4120: checking whether ln -s works
  280 configure:4124: result: yes
  281 configure:4134: checking whether in maintanance mode
  282 configure:4141: result: no
  283 configure:4145: checking whether in dmalloc mode
  284 configure:4152: result: no
  285 configure:4240: checking whether to enable dynamic module loading
  286 configure:4247: result: no
  287 configure:4502: checking which algorithms to include into library
  288 configure:4528: result: cbc cfb ctr ecb ncfb nofb ofb stream threeway cast-128 gost rijndael-128 safer-sk64 twofish  arcfour cast-256 loki97 rijndael-192 saferplus wake  blowfish-compat des rijndael-256 serpent xtea  blowfish enigma rc2 safer-sk128 tripledes
  289 configure:4560: checking for dirent.h that defines DIR
  290 configure:4584: gcc -c -g -O2  conftest.c >&5
  291 configure:4590: $? = 0
  292 configure:4594: test -z 
  293 			 || test ! -s conftest.err
  294 configure:4597: $? = 0
  295 configure:4600: test -s conftest.o
  296 configure:4603: $? = 0
  297 configure:4614: result: yes
  298 configure:4627: checking for library containing opendir
  299 configure:4657: gcc -o conftest -g -O2   conftest.c  >&5
  300 configure:4663: $? = 0
  301 configure:4667: test -z 
  302 			 || test ! -s conftest.err
  303 configure:4670: $? = 0
  304 configure:4673: test -s conftest
  305 configure:4676: $? = 0
  306 configure:4746: result: none required
  307 configure:4883: checking for egrep
  308 configure:4893: result: grep -E
  309 configure:4898: checking for ANSI C header files
  310 configure:4923: gcc -c -g -O2  conftest.c >&5
  311 configure:4929: $? = 0
  312 configure:4933: test -z 
  313 			 || test ! -s conftest.err
  314 configure:4936: $? = 0
  315 configure:4939: test -s conftest.o
  316 configure:4942: $? = 0
  317 configure:5031: gcc -o conftest -g -O2   conftest.c  >&5
  318 conftest.c: In function 'main':
  319 conftest.c:32: warning: incompatible implicit declaration of built-in function 'exit'
  320 configure:5034: $? = 0
  321 configure:5036: ./conftest
  322 configure:5039: $? = 0
  323 configure:5054: result: yes
  324 configure:5064: checking for inline
  325 configure:5085: gcc -c -g -O2  conftest.c >&5
  326 configure:5091: $? = 0
  327 configure:5095: test -z 
  328 			 || test ! -s conftest.err
  329 configure:5098: $? = 0
  330 configure:5101: test -s conftest.o
  331 configure:5104: $? = 0
  332 configure:5116: result: inline
  333 configure:5135: checking for an ANSI C-conforming const
  334 configure:5202: gcc -c -g -O2  conftest.c >&5
  335 configure:5208: $? = 0
  336 configure:5212: test -z 
  337 			 || test ! -s conftest.err
  338 configure:5215: $? = 0
  339 configure:5218: test -s conftest.o
  340 configure:5221: $? = 0
  341 configure:5232: result: yes
  342 configure:5257: checking for sys/types.h
  343 configure:5273: gcc -c -g -O2  conftest.c >&5
  344 configure:5279: $? = 0
  345 configure:5283: test -z 
  346 			 || test ! -s conftest.err
  347 configure:5286: $? = 0
  348 configure:5289: test -s conftest.o
  349 configure:5292: $? = 0
  350 configure:5303: result: yes
  351 configure:5257: checking for sys/stat.h
  352 configure:5273: gcc -c -g -O2  conftest.c >&5
  353 configure:5279: $? = 0
  354 configure:5283: test -z 
  355 			 || test ! -s conftest.err
  356 configure:5286: $? = 0
  357 configure:5289: test -s conftest.o
  358 configure:5292: $? = 0
  359 configure:5303: result: yes
  360 configure:5257: checking for stdlib.h
  361 configure:5273: gcc -c -g -O2  conftest.c >&5
  362 configure:5279: $? = 0
  363 configure:5283: test -z 
  364 			 || test ! -s conftest.err
  365 configure:5286: $? = 0
  366 configure:5289: test -s conftest.o
  367 configure:5292: $? = 0
  368 configure:5303: result: yes
  369 configure:5257: checking for string.h
  370 configure:5273: gcc -c -g -O2  conftest.c >&5
  371 configure:5279: $? = 0
  372 configure:5283: test -z 
  373 			 || test ! -s conftest.err
  374 configure:5286: $? = 0
  375 configure:5289: test -s conftest.o
  376 configure:5292: $? = 0
  377 configure:5303: result: yes
  378 configure:5257: checking for memory.h
  379 configure:5273: gcc -c -g -O2  conftest.c >&5
  380 configure:5279: $? = 0
  381 configure:5283: test -z 
  382 			 || test ! -s conftest.err
  383 configure:5286: $? = 0
  384 configure:5289: test -s conftest.o
  385 configure:5292: $? = 0
  386 configure:5303: result: yes
  387 configure:5257: checking for strings.h
  388 configure:5273: gcc -c -g -O2  conftest.c >&5
  389 configure:5279: $? = 0
  390 configure:5283: test -z 
  391 			 || test ! -s conftest.err
  392 configure:5286: $? = 0
  393 configure:5289: test -s conftest.o
  394 configure:5292: $? = 0
  395 configure:5303: result: yes
  396 configure:5257: checking for inttypes.h
  397 configure:5273: gcc -c -g -O2  conftest.c >&5
  398 configure:5279: $? = 0
  399 configure:5283: test -z 
  400 			 || test ! -s conftest.err
  401 configure:5286: $? = 0
  402 configure:5289: test -s conftest.o
  403 configure:5292: $? = 0
  404 configure:5303: result: yes
  405 configure:5257: checking for stdint.h
  406 configure:5273: gcc -c -g -O2  conftest.c >&5
  407 configure:5279: $? = 0
  408 configure:5283: test -z 
  409 			 || test ! -s conftest.err
  410 configure:5286: $? = 0
  411 configure:5289: test -s conftest.o
  412 configure:5292: $? = 0
  413 configure:5303: result: yes
  414 configure:5257: checking for unistd.h
  415 configure:5273: gcc -c -g -O2  conftest.c >&5
  416 configure:5279: $? = 0
  417 configure:5283: test -z 
  418 			 || test ! -s conftest.err
  419 configure:5286: $? = 0
  420 configure:5289: test -s conftest.o
  421 configure:5292: $? = 0
  422 configure:5303: result: yes
  423 configure:5335: checking argz.h usability
  424 configure:5347: gcc -c -g -O2  conftest.c >&5
  425 configure:5353: $? = 0
  426 configure:5357: test -z 
  427 			 || test ! -s conftest.err
  428 configure:5360: $? = 0
  429 configure:5363: test -s conftest.o
  430 configure:5366: $? = 0
  431 configure:5376: result: yes
  432 configure:5380: checking argz.h presence
  433 configure:5390: gcc -E  conftest.c
  434 configure:5396: $? = 0
  435 configure:5416: result: yes
  436 configure:5451: checking for argz.h
  437 configure:5458: result: yes
  438 configure:5335: checking byteswap.h usability
  439 configure:5347: gcc -c -g -O2  conftest.c >&5
  440 configure:5353: $? = 0
  441 configure:5357: test -z 
  442 			 || test ! -s conftest.err
  443 configure:5360: $? = 0
  444 configure:5363: test -s conftest.o
  445 configure:5366: $? = 0
  446 configure:5376: result: yes
  447 configure:5380: checking byteswap.h presence
  448 configure:5390: gcc -E  conftest.c
  449 configure:5396: $? = 0
  450 configure:5416: result: yes
  451 configure:5451: checking for byteswap.h
  452 configure:5458: result: yes
  453 configure:5335: checking dirent.h usability
  454 configure:5347: gcc -c -g -O2  conftest.c >&5
  455 configure:5353: $? = 0
  456 configure:5357: test -z 
  457 			 || test ! -s conftest.err
  458 configure:5360: $? = 0
  459 configure:5363: test -s conftest.o
  460 configure:5366: $? = 0
  461 configure:5376: result: yes
  462 configure:5380: checking dirent.h presence
  463 configure:5390: gcc -E  conftest.c
  464 configure:5396: $? = 0
  465 configure:5416: result: yes
  466 configure:5451: checking for dirent.h
  467 configure:5458: result: yes
  468 configure:5335: checking dlfcn.h usability
  469 configure:5347: gcc -c -g -O2  conftest.c >&5
  470 configure:5353: $? = 0
  471 configure:5357: test -z 
  472 			 || test ! -s conftest.err
  473 configure:5360: $? = 0
  474 configure:5363: test -s conftest.o
  475 configure:5366: $? = 0
  476 configure:5376: result: yes
  477 configure:5380: checking dlfcn.h presence
  478 configure:5390: gcc -E  conftest.c
  479 configure:5396: $? = 0
  480 configure:5416: result: yes
  481 configure:5451: checking for dlfcn.h
  482 configure:5458: result: yes
  483 configure:5335: checking endian.h usability
  484 configure:5347: gcc -c -g -O2  conftest.c >&5
  485 configure:5353: $? = 0
  486 configure:5357: test -z 
  487 			 || test ! -s conftest.err
  488 configure:5360: $? = 0
  489 configure:5363: test -s conftest.o
  490 configure:5366: $? = 0
  491 configure:5376: result: yes
  492 configure:5380: checking endian.h presence
  493 configure:5390: gcc -E  conftest.c
  494 configure:5396: $? = 0
  495 configure:5416: result: yes
  496 configure:5451: checking for endian.h
  497 configure:5458: result: yes
  498 configure:5335: checking malloc.h usability
  499 configure:5347: gcc -c -g -O2  conftest.c >&5
  500 configure:5353: $? = 0
  501 configure:5357: test -z 
  502 			 || test ! -s conftest.err
  503 configure:5360: $? = 0
  504 configure:5363: test -s conftest.o
  505 configure:5366: $? = 0
  506 configure:5376: result: yes
  507 configure:5380: checking malloc.h presence
  508 configure:5390: gcc -E  conftest.c
  509 configure:5396: $? = 0
  510 configure:5416: result: yes
  511 configure:5451: checking for malloc.h
  512 configure:5458: result: yes
  513 configure:5326: checking for memory.h
  514 configure:5331: result: yes
  515 configure:5478: checking for stdlib.h
  516 configure:5483: result: yes
  517 configure:5478: checking for string.h
  518 configure:5483: result: yes
  519 configure:5478: checking for strings.h
  520 configure:5483: result: yes
  521 configure:5639: checking sys/endian.h usability
  522 configure:5651: gcc -c -g -O2  conftest.c >&5
  523 conftest.c:69:24: error: sys/endian.h: No such file or directory
  524 configure:5657: $? = 1
  525 configure: failed program was:
  526 | /* confdefs.h.  */
  527 | 
  528 | #define PACKAGE_NAME ""
  529 | #define PACKAGE_TARNAME ""
  530 | #define PACKAGE_VERSION ""
  531 | #define PACKAGE_STRING ""
  532 | #define PACKAGE_BUGREPORT ""
  533 | #define PACKAGE "libmcrypt"
  534 | #define VERSION "2.5.8"
  535 | #ifdef __cplusplus
  536 | extern "C" void std::exit (int) throw (); using std::exit;
  537 | #endif
  538 | #define HAVE_DIRENT_H 1
  539 | #define STDC_HEADERS 1
  540 | #define HAVE_SYS_TYPES_H 1
  541 | #define HAVE_SYS_STAT_H 1
  542 | #define HAVE_STDLIB_H 1
  543 | #define HAVE_STRING_H 1
  544 | #define HAVE_MEMORY_H 1
  545 | #define HAVE_STRINGS_H 1
  546 | #define HAVE_INTTYPES_H 1
  547 | #define HAVE_STDINT_H 1
  548 | #define HAVE_UNISTD_H 1
  549 | #define HAVE_ARGZ_H 1
  550 | #define HAVE_BYTESWAP_H 1
  551 | #define HAVE_DIRENT_H 1
  552 | #define HAVE_DLFCN_H 1
  553 | #define HAVE_ENDIAN_H 1
  554 | #define HAVE_MALLOC_H 1
  555 | #define HAVE_MEMORY_H 1
  556 | #define HAVE_STDLIB_H 1
  557 | #define HAVE_STRING_H 1
  558 | #define HAVE_STRINGS_H 1
  559 | /* end confdefs.h.  */
  560 | #include <stdio.h>
  561 | #if HAVE_SYS_TYPES_H
  562 | # include <sys/types.h>
  563 | #endif
  564 | #if HAVE_SYS_STAT_H
  565 | # include <sys/stat.h>
  566 | #endif
  567 | #if STDC_HEADERS
  568 | # include <stdlib.h>
  569 | # include <stddef.h>
  570 | #else
  571 | # if HAVE_STDLIB_H
  572 | #  include <stdlib.h>
  573 | # endif
  574 | #endif
  575 | #if HAVE_STRING_H
  576 | # if !STDC_HEADERS && HAVE_MEMORY_H
  577 | #  include <memory.h>
  578 | # endif
  579 | # include <string.h>
  580 | #endif
  581 | #if HAVE_STRINGS_H
  582 | # include <strings.h>
  583 | #endif
  584 | #if HAVE_INTTYPES_H
  585 | # include <inttypes.h>
  586 | #else
  587 | # if HAVE_STDINT_H
  588 | #  include <stdint.h>
  589 | # endif
  590 | #endif
  591 | #if HAVE_UNISTD_H
  592 | # include <unistd.h>
  593 | #endif
  594 | #include <sys/endian.h>
  595 configure:5680: result: no
  596 configure:5684: checking sys/endian.h presence
  597 configure:5694: gcc -E  conftest.c
  598 conftest.c:35:24: error: sys/endian.h: No such file or directory
  599 configure:5700: $? = 1
  600 configure: failed program was:
  601 | /* confdefs.h.  */
  602 | 
  603 | #define PACKAGE_NAME ""
  604 | #define PACKAGE_TARNAME ""
  605 | #define PACKAGE_VERSION ""
  606 | #define PACKAGE_STRING ""
  607 | #define PACKAGE_BUGREPORT ""
  608 | #define PACKAGE "libmcrypt"
  609 | #define VERSION "2.5.8"
  610 | #ifdef __cplusplus
  611 | extern "C" void std::exit (int) throw (); using std::exit;
  612 | #endif
  613 | #define HAVE_DIRENT_H 1
  614 | #define STDC_HEADERS 1
  615 | #define HAVE_SYS_TYPES_H 1
  616 | #define HAVE_SYS_STAT_H 1
  617 | #define HAVE_STDLIB_H 1
  618 | #define HAVE_STRING_H 1
  619 | #define HAVE_MEMORY_H 1
  620 | #define HAVE_STRINGS_H 1
  621 | #define HAVE_INTTYPES_H 1
  622 | #define HAVE_STDINT_H 1
  623 | #define HAVE_UNISTD_H 1
  624 | #define HAVE_ARGZ_H 1
  625 | #define HAVE_BYTESWAP_H 1
  626 | #define HAVE_DIRENT_H 1
  627 | #define HAVE_DLFCN_H 1
  628 | #define HAVE_ENDIAN_H 1
  629 | #define HAVE_MALLOC_H 1
  630 | #define HAVE_MEMORY_H 1
  631 | #define HAVE_STDLIB_H 1
  632 | #define HAVE_STRING_H 1
  633 | #define HAVE_STRINGS_H 1
  634 | /* end confdefs.h.  */
  635 | #include <sys/endian.h>
  636 configure:5720: result: no
  637 configure:5755: checking for sys/endian.h
  638 configure:5762: result: no
  639 configure:5630: checking for sys/types.h
  640 configure:5635: result: yes
  641 configure:5639: checking sys/mman.h usability
  642 configure:5651: gcc -c -g -O2  conftest.c >&5
  643 configure:5657: $? = 0
  644 configure:5661: test -z 
  645 			 || test ! -s conftest.err
  646 configure:5664: $? = 0
  647 configure:5667: test -s conftest.o
  648 configure:5670: $? = 0
  649 configure:5680: result: yes
  650 configure:5684: checking sys/mman.h presence
  651 configure:5694: gcc -E  conftest.c
  652 configure:5700: $? = 0
  653 configure:5720: result: yes
  654 configure:5755: checking for sys/mman.h
  655 configure:5762: result: yes
  656 configure:5790: checking limits.h usability
  657 configure:5802: gcc -c -g -O2  conftest.c >&5
  658 configure:5808: $? = 0
  659 configure:5812: test -z 
  660 			 || test ! -s conftest.err
  661 configure:5815: $? = 0
  662 configure:5818: test -s conftest.o
  663 configure:5821: $? = 0
  664 configure:5831: result: yes
  665 configure:5835: checking limits.h presence
  666 configure:5845: gcc -E  conftest.c
  667 configure:5851: $? = 0
  668 configure:5871: result: yes
  669 configure:5906: checking for limits.h
  670 configure:5913: result: yes
  671 configure:5781: checking for unistd.h
  672 configure:5786: result: yes
  673 configure:5927: checking whether closedir returns void
  674 configure:5956: gcc -o conftest -g -O2   conftest.c  >&5
  675 configure:5959: $? = 0
  676 configure:5961: ./conftest
  677 configure:5964: $? = 0
  678 configure:5978: result: no
  679 configure:5993: checking for stdlib.h
  680 configure:5998: result: yes
  681 configure:6138: checking for GNU libc compatible malloc
  682 configure:6167: gcc -o conftest -g -O2   conftest.c  >&5
  683 configure:6170: $? = 0
  684 configure:6172: ./conftest
  685 configure:6175: $? = 0
  686 configure:6189: result: yes
  687 configure:6219: checking for working memcmp
  688 configure:6267: gcc -o conftest -g -O2   conftest.c  >&5
  689 configure:6270: $? = 0
  690 configure:6272: ./conftest
  691 configure:6275: $? = 0
  692 configure:6289: result: yes
  693 configure:6305: checking for stdlib.h
  694 configure:6310: result: yes
  695 configure:6450: checking for GNU libc compatible realloc
  696 configure:6479: gcc -o conftest -g -O2   conftest.c  >&5
  697 configure:6482: $? = 0
  698 configure:6484: ./conftest
  699 configure:6487: $? = 0
  700 configure:6501: result: yes
  701 configure:6543: checking for bzero
  702 configure:6600: gcc -o conftest -g -O2   conftest.c  >&5
  703 conftest.c:67: warning: conflicting types for built-in function 'bzero'
  704 configure:6606: $? = 0
  705 configure:6610: test -z 
  706 			 || test ! -s conftest.err
  707 configure:6613: $? = 0
  708 configure:6616: test -s conftest
  709 configure:6619: $? = 0
  710 configure:6631: result: yes
  711 configure:6543: checking for memmove
  712 configure:6600: gcc -o conftest -g -O2   conftest.c  >&5
  713 conftest.c:68: warning: conflicting types for built-in function 'memmove'
  714 configure:6606: $? = 0
  715 configure:6610: test -z 
  716 			 || test ! -s conftest.err
  717 configure:6613: $? = 0
  718 configure:6616: test -s conftest
  719 configure:6619: $? = 0
  720 configure:6631: result: yes
  721 configure:6543: checking for memset
  722 configure:6600: gcc -o conftest -g -O2   conftest.c  >&5
  723 conftest.c:69: warning: conflicting types for built-in function 'memset'
  724 configure:6606: $? = 0
  725 configure:6610: test -z 
  726 			 || test ! -s conftest.err
  727 configure:6613: $? = 0
  728 configure:6616: test -s conftest
  729 configure:6619: $? = 0
  730 configure:6631: result: yes
  731 configure:6543: checking for mlock
  732 configure:6600: gcc -o conftest -g -O2   conftest.c  >&5
  733 configure:6606: $? = 0
  734 configure:6610: test -z 
  735 			 || test ! -s conftest.err
  736 configure:6613: $? = 0
  737 configure:6616: test -s conftest
  738 configure:6619: $? = 0
  739 configure:6631: result: yes
  740 configure:6543: checking for readdir_r
  741 configure:6600: gcc -o conftest -g -O2   conftest.c  >&5
  742 configure:6606: $? = 0
  743 configure:6610: test -z 
  744 			 || test ! -s conftest.err
  745 configure:6613: $? = 0
  746 configure:6616: test -s conftest
  747 configure:6619: $? = 0
  748 configure:6631: result: yes
  749 configure:6543: checking for strchr
  750 configure:6600: gcc -o conftest -g -O2   conftest.c  >&5
  751 conftest.c:72: warning: conflicting types for built-in function 'strchr'
  752 configure:6606: $? = 0
  753 configure:6610: test -z 
  754 			 || test ! -s conftest.err
  755 configure:6613: $? = 0
  756 configure:6616: test -s conftest
  757 configure:6619: $? = 0
  758 configure:6631: result: yes
  759 configure:6543: checking for strdup
  760 configure:6600: gcc -o conftest -g -O2   conftest.c  >&5
  761 conftest.c:73: warning: conflicting types for built-in function 'strdup'
  762 configure:6606: $? = 0
  763 configure:6610: test -z 
  764 			 || test ! -s conftest.err
  765 configure:6613: $? = 0
  766 configure:6616: test -s conftest
  767 configure:6619: $? = 0
  768 configure:6631: result: yes
  769 configure:6543: checking for strrchr
  770 configure:6600: gcc -o conftest -g -O2   conftest.c  >&5
  771 conftest.c:74: warning: conflicting types for built-in function 'strrchr'
  772 configure:6606: $? = 0
  773 configure:6610: test -z 
  774 			 || test ! -s conftest.err
  775 configure:6613: $? = 0
  776 configure:6616: test -s conftest
  777 configure:6619: $? = 0
  778 configure:6631: result: yes
  779 configure:6645: checking for readdir,,
  780 configure:6702: gcc -o conftest -g -O2   conftest.c  >&5
  781 conftest.c:53:16: warning: missing whitespace after the macro name
  782 conftest.c:66:15: warning: extra tokens at end of #undef directive
  783 conftest.c:75: error: expected identifier or '(' before ',' token
  784 conftest.c:79:28: error: missing ')' after "defined"
  785 conftest.c:79:30: error: operator ',' has no right operand
  786 conftest.c:82: warning: initialization makes pointer from integer without a cast
  787 conftest.c:82: error: initializer element is not constant
  788 conftest.c:82: error: expected identifier or '(' before ',' token
  789 conftest.c: In function 'main':
  790 conftest.c:91: warning: comparison between pointer and integer
  791 conftest.c:91: error: expected expression before ',' token
  792 configure:6708: $? = 1
  793 configure: failed program was:
  794 | /* confdefs.h.  */
  795 | 
  796 | #define PACKAGE_NAME ""
  797 | #define PACKAGE_TARNAME ""
  798 | #define PACKAGE_VERSION ""
  799 | #define PACKAGE_STRING ""
  800 | #define PACKAGE_BUGREPORT ""
  801 | #define PACKAGE "libmcrypt"
  802 | #define VERSION "2.5.8"
  803 | #ifdef __cplusplus
  804 | extern "C" void std::exit (int) throw (); using std::exit;
  805 | #endif
  806 | #define HAVE_DIRENT_H 1
  807 | #define STDC_HEADERS 1
  808 | #define HAVE_SYS_TYPES_H 1
  809 | #define HAVE_SYS_STAT_H 1
  810 | #define HAVE_STDLIB_H 1
  811 | #define HAVE_STRING_H 1
  812 | #define HAVE_MEMORY_H 1
  813 | #define HAVE_STRINGS_H 1
  814 | #define HAVE_INTTYPES_H 1
  815 | #define HAVE_STDINT_H 1
  816 | #define HAVE_UNISTD_H 1
  817 | #define HAVE_ARGZ_H 1
  818 | #define HAVE_BYTESWAP_H 1
  819 | #define HAVE_DIRENT_H 1
  820 | #define HAVE_DLFCN_H 1
  821 | #define HAVE_ENDIAN_H 1
  822 | #define HAVE_MALLOC_H 1
  823 | #define HAVE_MEMORY_H 1
  824 | #define HAVE_STDLIB_H 1
  825 | #define HAVE_STRING_H 1
  826 | #define HAVE_STRINGS_H 1
  827 | #define HAVE_SYS_TYPES_H 1
  828 | #define HAVE_SYS_MMAN_H 1
  829 | #define HAVE_LIMITS_H 1
  830 | #define HAVE_UNISTD_H 1
  831 | #define HAVE_STDLIB_H 1
  832 | #define HAVE_MALLOC 1
  833 | #define HAVE_STDLIB_H 1
  834 | #define HAVE_REALLOC 1
  835 | #define HAVE_BZERO 1
  836 | #define HAVE_MEMMOVE 1
  837 | #define HAVE_MEMSET 1
  838 | #define HAVE_MLOCK 1
  839 | #define HAVE_READDIR_R 1
  840 | #define HAVE_STRCHR 1
  841 | #define HAVE_STRDUP 1
  842 | #define HAVE_STRRCHR 1
  843 | /* end confdefs.h.  */
  844 | /* Define readdir,, to an innocuous variant, in case <limits.h> declares readdir,,.
  845 |    For example, HP-UX 11i <limits.h> declares gettimeofday.  */
  846 | #define readdir,, innocuous_readdir,,
  847 | 
  848 | /* System header to define __stub macros and hopefully few prototypes,
  849 |     which can conflict with char readdir,, (); below.
  850 |     Prefer <limits.h> to <assert.h> if __STDC__ is defined, since
  851 |     <limits.h> exists even on freestanding compilers.  */
  852 | 
  853 | #ifdef __STDC__
  854 | # include <limits.h>
  855 | #else
  856 | # include <assert.h>
  857 | #endif
  858 | 
  859 | #undef readdir,,
  860 | 
  861 | /* Override any gcc2 internal prototype to avoid an error.  */
  862 | #ifdef __cplusplus
  863 | extern "C"
  864 | {
  865 | #endif
  866 | /* We use char because int might match the return type of a gcc2
  867 |    builtin and then its argument prototype would still apply.  */
  868 | char readdir,, ();
  869 | /* The GNU C library defines this for functions which it implements
  870 |     to always fail with ENOSYS.  Some functions are actually named
  871 |     something starting with __ and the normal name is an alias.  */
  872 | #if defined (__stub_readdir,,) || defined (__stub___readdir,,)
  873 | choke me
  874 | #else
  875 | char (*f) () = readdir,,;
  876 | #endif
  877 | #ifdef __cplusplus
  878 | }
  879 | #endif
  880 | 
  881 | int
  882 | main ()
  883 | {
  884 | return f != readdir,,;
  885 |   ;
  886 |   return 0;
  887 | }
  888 configure:6733: result: no
  889 configure:6747: checking for bcopy,,
  890 configure:6804: gcc -o conftest -g -O2   conftest.c  >&5
  891 conftest.c:53:14: warning: missing whitespace after the macro name
  892 conftest.c:66:13: warning: extra tokens at end of #undef directive
  893 conftest.c:75: warning: built-in function 'bcopy' declared as non-function
  894 conftest.c:75: error: expected identifier or '(' before ',' token
  895 conftest.c:79:26: error: missing ')' after "defined"
  896 conftest.c:79:28: error: operator ',' has no right operand
  897 conftest.c:82: warning: initialization makes pointer from integer without a cast
  898 conftest.c:82: error: initializer element is not constant
  899 conftest.c:82: error: expected identifier or '(' before ',' token
  900 conftest.c: In function 'main':
  901 conftest.c:91: warning: comparison between pointer and integer
  902 conftest.c:91: error: expected expression before ',' token
  903 configure:6810: $? = 1
  904 configure: failed program was:
  905 | /* confdefs.h.  */
  906 | 
  907 | #define PACKAGE_NAME ""
  908 | #define PACKAGE_TARNAME ""
  909 | #define PACKAGE_VERSION ""
  910 | #define PACKAGE_STRING ""
  911 | #define PACKAGE_BUGREPORT ""
  912 | #define PACKAGE "libmcrypt"
  913 | #define VERSION "2.5.8"
  914 | #ifdef __cplusplus
  915 | extern "C" void std::exit (int) throw (); using std::exit;
  916 | #endif
  917 | #define HAVE_DIRENT_H 1
  918 | #define STDC_HEADERS 1
  919 | #define HAVE_SYS_TYPES_H 1
  920 | #define HAVE_SYS_STAT_H 1
  921 | #define HAVE_STDLIB_H 1
  922 | #define HAVE_STRING_H 1
  923 | #define HAVE_MEMORY_H 1
  924 | #define HAVE_STRINGS_H 1
  925 | #define HAVE_INTTYPES_H 1
  926 | #define HAVE_STDINT_H 1
  927 | #define HAVE_UNISTD_H 1
  928 | #define HAVE_ARGZ_H 1
  929 | #define HAVE_BYTESWAP_H 1
  930 | #define HAVE_DIRENT_H 1
  931 | #define HAVE_DLFCN_H 1
  932 | #define HAVE_ENDIAN_H 1
  933 | #define HAVE_MALLOC_H 1
  934 | #define HAVE_MEMORY_H 1
  935 | #define HAVE_STDLIB_H 1
  936 | #define HAVE_STRING_H 1
  937 | #define HAVE_STRINGS_H 1
  938 | #define HAVE_SYS_TYPES_H 1
  939 | #define HAVE_SYS_MMAN_H 1
  940 | #define HAVE_LIMITS_H 1
  941 | #define HAVE_UNISTD_H 1
  942 | #define HAVE_STDLIB_H 1
  943 | #define HAVE_MALLOC 1
  944 | #define HAVE_STDLIB_H 1
  945 | #define HAVE_REALLOC 1
  946 | #define HAVE_BZERO 1
  947 | #define HAVE_MEMMOVE 1
  948 | #define HAVE_MEMSET 1
  949 | #define HAVE_MLOCK 1
  950 | #define HAVE_READDIR_R 1
  951 | #define HAVE_STRCHR 1
  952 | #define HAVE_STRDUP 1
  953 | #define HAVE_STRRCHR 1
  954 | /* end confdefs.h.  */
  955 | /* Define bcopy,, to an innocuous variant, in case <limits.h> declares bcopy,,.
  956 |    For example, HP-UX 11i <limits.h> declares gettimeofday.  */
  957 | #define bcopy,, innocuous_bcopy,,
  958 | 
  959 | /* System header to define __stub macros and hopefully few prototypes,
  960 |     which can conflict with char bcopy,, (); below.
  961 |     Prefer <limits.h> to <assert.h> if __STDC__ is defined, since
  962 |     <limits.h> exists even on freestanding compilers.  */
  963 | 
  964 | #ifdef __STDC__
  965 | # include <limits.h>
  966 | #else
  967 | # include <assert.h>
  968 | #endif
  969 | 
  970 | #undef bcopy,,
  971 | 
  972 | /* Override any gcc2 internal prototype to avoid an error.  */
  973 | #ifdef __cplusplus
  974 | extern "C"
  975 | {
  976 | #endif
  977 | /* We use char because int might match the return type of a gcc2
  978 |    builtin and then its argument prototype would still apply.  */
  979 | char bcopy,, ();
  980 | /* The GNU C library defines this for functions which it implements
  981 |     to always fail with ENOSYS.  Some functions are actually named
  982 |     something starting with __ and the normal name is an alias.  */
  983 | #if defined (__stub_bcopy,,) || defined (__stub___bcopy,,)
  984 | choke me
  985 | #else
  986 | char (*f) () = bcopy,,;
  987 | #endif
  988 | #ifdef __cplusplus
  989 | }
  990 | #endif
  991 | 
  992 | int
  993 | main ()
  994 | {
  995 | return f != bcopy,,;
  996 |   ;
  997 |   return 0;
  998 | }
  999 configure:6835: result: no
 1000 configure:6846: checking whether byte ordering is bigendian
 1001 configure:6873: gcc -c -g -O2  conftest.c >&5
 1002 configure:6879: $? = 0
 1003 configure:6883: test -z 
 1004 			 || test ! -s conftest.err
 1005 configure:6886: $? = 0
 1006 configure:6889: test -s conftest.o
 1007 configure:6892: $? = 0
 1008 configure:6916: gcc -c -g -O2  conftest.c >&5
 1009 conftest.c: In function 'main':
 1010 conftest.c:58: error: 'not' undeclared (first use in this function)
 1011 conftest.c:58: error: (Each undeclared identifier is reported only once
 1012 conftest.c:58: error: for each function it appears in.)
 1013 conftest.c:58: error: expected ';' before 'big'
 1014 configure:6922: $? = 1
 1015 configure: failed program was:
 1016 | /* confdefs.h.  */
 1017 | 
 1018 | #define PACKAGE_NAME ""
 1019 | #define PACKAGE_TARNAME ""
 1020 | #define PACKAGE_VERSION ""
 1021 | #define PACKAGE_STRING ""
 1022 | #define PACKAGE_BUGREPORT ""
 1023 | #define PACKAGE "libmcrypt"
 1024 | #define VERSION "2.5.8"
 1025 | #ifdef __cplusplus
 1026 | extern "C" void std::exit (int) throw (); using std::exit;
 1027 | #endif
 1028 | #define HAVE_DIRENT_H 1
 1029 | #define STDC_HEADERS 1
 1030 | #define HAVE_SYS_TYPES_H 1
 1031 | #define HAVE_SYS_STAT_H 1
 1032 | #define HAVE_STDLIB_H 1
 1033 | #define HAVE_STRING_H 1
 1034 | #define HAVE_MEMORY_H 1
 1035 | #define HAVE_STRINGS_H 1
 1036 | #define HAVE_INTTYPES_H 1
 1037 | #define HAVE_STDINT_H 1
 1038 | #define HAVE_UNISTD_H 1
 1039 | #define HAVE_ARGZ_H 1
 1040 | #define HAVE_BYTESWAP_H 1
 1041 | #define HAVE_DIRENT_H 1
 1042 | #define HAVE_DLFCN_H 1
 1043 | #define HAVE_ENDIAN_H 1
 1044 | #define HAVE_MALLOC_H 1
 1045 | #define HAVE_MEMORY_H 1
 1046 | #define HAVE_STDLIB_H 1
 1047 | #define HAVE_STRING_H 1
 1048 | #define HAVE_STRINGS_H 1
 1049 | #define HAVE_SYS_TYPES_H 1
 1050 | #define HAVE_SYS_MMAN_H 1
 1051 | #define HAVE_LIMITS_H 1
 1052 | #define HAVE_UNISTD_H 1
 1053 | #define HAVE_STDLIB_H 1
 1054 | #define HAVE_MALLOC 1
 1055 | #define HAVE_STDLIB_H 1
 1056 | #define HAVE_REALLOC 1
 1057 | #define HAVE_BZERO 1
 1058 | #define HAVE_MEMMOVE 1
 1059 | #define HAVE_MEMSET 1
 1060 | #define HAVE_MLOCK 1
 1061 | #define HAVE_READDIR_R 1
 1062 | #define HAVE_STRCHR 1
 1063 | #define HAVE_STRDUP 1
 1064 | #define HAVE_STRRCHR 1
 1065 | /* end confdefs.h.  */
 1066 | #include <sys/types.h>
 1067 | #include <sys/param.h>
 1068 | 
 1069 | int
 1070 | main ()
 1071 | {
 1072 | #if BYTE_ORDER != BIG_ENDIAN
 1073 |  not big endian
 1074 | #endif
 1075 | 
 1076 |   ;
 1077 |   return 0;
 1078 | }
 1079 configure:7057: result: no
 1080 configure:7076: checking for unsigned long int
 1081 configure:7100: gcc -c -g -O2  conftest.c >&5
 1082 configure:7106: $? = 0
 1083 configure:7110: test -z 
 1084 			 || test ! -s conftest.err
 1085 configure:7113: $? = 0
 1086 configure:7116: test -s conftest.o
 1087 configure:7119: $? = 0
 1088 configure:7130: result: yes
 1089 configure:7133: checking size of unsigned long int
 1090 configure:7452: gcc -o conftest -g -O2   conftest.c  >&5
 1091 configure:7455: $? = 0
 1092 configure:7457: ./conftest
 1093 configure:7460: $? = 0
 1094 configure:7483: result: 4
 1095 configure:7490: checking for unsigned int
 1096 configure:7514: gcc -c -g -O2  conftest.c >&5
 1097 configure:7520: $? = 0
 1098 configure:7524: test -z 
 1099 			 || test ! -s conftest.err
 1100 configure:7527: $? = 0
 1101 configure:7530: test -s conftest.o
 1102 configure:7533: $? = 0
 1103 configure:7544: result: yes
 1104 configure:7547: checking size of unsigned int
 1105 configure:7866: gcc -o conftest -g -O2   conftest.c  >&5
 1106 configure:7869: $? = 0
 1107 configure:7871: ./conftest
 1108 configure:7874: $? = 0
 1109 configure:7897: result: 4
 1110 configure:7904: checking for unsigned short int
 1111 configure:7928: gcc -c -g -O2  conftest.c >&5
 1112 configure:7934: $? = 0
 1113 configure:7938: test -z 
 1114 			 || test ! -s conftest.err
 1115 configure:7941: $? = 0
 1116 configure:7944: test -s conftest.o
 1117 configure:7947: $? = 0
 1118 configure:7958: result: yes
 1119 configure:7961: checking size of unsigned short int
 1120 configure:8280: gcc -o conftest -g -O2   conftest.c  >&5
 1121 configure:8283: $? = 0
 1122 configure:8285: ./conftest
 1123 configure:8288: $? = 0
 1124 configure:8311: result: 2
 1125 configure:8318: checking for unsigned char
 1126 configure:8342: gcc -c -g -O2  conftest.c >&5
 1127 configure:8348: $? = 0
 1128 configure:8352: test -z 
 1129 			 || test ! -s conftest.err
 1130 configure:8355: $? = 0
 1131 configure:8358: test -s conftest.o
 1132 configure:8361: $? = 0
 1133 configure:8372: result: yes
 1134 configure:8375: checking size of unsigned char
 1135 configure:8694: gcc -o conftest -g -O2   conftest.c  >&5
 1136 configure:8697: $? = 0
 1137 configure:8699: ./conftest
 1138 configure:8702: $? = 0
 1139 configure:8725: result: 1
 1140 configure:8788: checking for a sed that does not truncate output
 1141 configure:8844: result: /bin/sed
 1142 configure:8858: checking for ld used by gcc
 1143 configure:8925: result: /usr/bin/ld
 1144 configure:8934: checking if the linker (/usr/bin/ld) is GNU ld
 1145 configure:8949: result: yes
 1146 configure:8954: checking for /usr/bin/ld option to reload object files
 1147 configure:8961: result: -r
 1148 configure:8979: checking for BSD-compatible nm
 1149 configure:9028: result: /usr/bin/nm -B
 1150 configure:9032: checking how to recognise dependent libraries
 1151 configure:9208: result: pass_all
 1152 configure:9686: checking for dlfcn.h
 1153 configure:9691: result: yes
 1154 configure:9841: checking how to run the C++ preprocessor
 1155 configure:9872: g++ -E  conftest.cc
 1156 configure:9878: $? = 0
 1157 configure:9910: g++ -E  conftest.cc
 1158 conftest.cc:56:28: error: ac_nonexistent.h: No such file or directory
 1159 configure:9916: $? = 1
 1160 configure: failed program was:
 1161 | /* confdefs.h.  */
 1162 | 
 1163 | #define PACKAGE_NAME ""
 1164 | #define PACKAGE_TARNAME ""
 1165 | #define PACKAGE_VERSION ""
 1166 | #define PACKAGE_STRING ""
 1167 | #define PACKAGE_BUGREPORT ""
 1168 | #define PACKAGE "libmcrypt"
 1169 | #define VERSION "2.5.8"
 1170 | #ifdef __cplusplus
 1171 | extern "C" void std::exit (int) throw (); using std::exit;
 1172 | #endif
 1173 | #define HAVE_DIRENT_H 1
 1174 | #define STDC_HEADERS 1
 1175 | #define HAVE_SYS_TYPES_H 1
 1176 | #define HAVE_SYS_STAT_H 1
 1177 | #define HAVE_STDLIB_H 1
 1178 | #define HAVE_STRING_H 1
 1179 | #define HAVE_MEMORY_H 1
 1180 | #define HAVE_STRINGS_H 1
 1181 | #define HAVE_INTTYPES_H 1
 1182 | #define HAVE_STDINT_H 1
 1183 | #define HAVE_UNISTD_H 1
 1184 | #define HAVE_ARGZ_H 1
 1185 | #define HAVE_BYTESWAP_H 1
 1186 | #define HAVE_DIRENT_H 1
 1187 | #define HAVE_DLFCN_H 1
 1188 | #define HAVE_ENDIAN_H 1
 1189 | #define HAVE_MALLOC_H 1
 1190 | #define HAVE_MEMORY_H 1
 1191 | #define HAVE_STDLIB_H 1
 1192 | #define HAVE_STRING_H 1
 1193 | #define HAVE_STRINGS_H 1
 1194 | #define HAVE_SYS_TYPES_H 1
 1195 | #define HAVE_SYS_MMAN_H 1
 1196 | #define HAVE_LIMITS_H 1
 1197 | #define HAVE_UNISTD_H 1
 1198 | #define HAVE_STDLIB_H 1
 1199 | #define HAVE_MALLOC 1
 1200 | #define HAVE_STDLIB_H 1
 1201 | #define HAVE_REALLOC 1
 1202 | #define HAVE_BZERO 1
 1203 | #define HAVE_MEMMOVE 1
 1204 | #define HAVE_MEMSET 1
 1205 | #define HAVE_MLOCK 1
 1206 | #define HAVE_READDIR_R 1
 1207 | #define HAVE_STRCHR 1
 1208 | #define HAVE_STRDUP 1
 1209 | #define HAVE_STRRCHR 1
 1210 | #define SIZEOF_UNSIGNED_LONG_INT 4
 1211 | #define SIZEOF_UNSIGNED_INT 4
 1212 | #define SIZEOF_UNSIGNED_SHORT_INT 2
 1213 | #define SIZEOF_UNSIGNED_CHAR 1
 1214 | #define HAVE_DLFCN_H 1
 1215 | /* end confdefs.h.  */
 1216 | #include <ac_nonexistent.h>
 1217 configure:9955: result: g++ -E
 1218 configure:9979: g++ -E  conftest.cc
 1219 configure:9985: $? = 0
 1220 configure:10017: g++ -E  conftest.cc
 1221 conftest.cc:56:28: error: ac_nonexistent.h: No such file or directory
 1222 configure:10023: $? = 1
 1223 configure: failed program was:
 1224 | /* confdefs.h.  */
 1225 | 
 1226 | #define PACKAGE_NAME ""
 1227 | #define PACKAGE_TARNAME ""
 1228 | #define PACKAGE_VERSION ""
 1229 | #define PACKAGE_STRING ""
 1230 | #define PACKAGE_BUGREPORT ""
 1231 | #define PACKAGE "libmcrypt"
 1232 | #define VERSION "2.5.8"
 1233 | #ifdef __cplusplus
 1234 | extern "C" void std::exit (int) throw (); using std::exit;
 1235 | #endif
 1236 | #define HAVE_DIRENT_H 1
 1237 | #define STDC_HEADERS 1
 1238 | #define HAVE_SYS_TYPES_H 1
 1239 | #define HAVE_SYS_STAT_H 1
 1240 | #define HAVE_STDLIB_H 1
 1241 | #define HAVE_STRING_H 1
 1242 | #define HAVE_MEMORY_H 1
 1243 | #define HAVE_STRINGS_H 1
 1244 | #define HAVE_INTTYPES_H 1
 1245 | #define HAVE_STDINT_H 1
 1246 | #define HAVE_UNISTD_H 1
 1247 | #define HAVE_ARGZ_H 1
 1248 | #define HAVE_BYTESWAP_H 1
 1249 | #define HAVE_DIRENT_H 1
 1250 | #define HAVE_DLFCN_H 1
 1251 | #define HAVE_ENDIAN_H 1
 1252 | #define HAVE_MALLOC_H 1
 1253 | #define HAVE_MEMORY_H 1
 1254 | #define HAVE_STDLIB_H 1
 1255 | #define HAVE_STRING_H 1
 1256 | #define HAVE_STRINGS_H 1
 1257 | #define HAVE_SYS_TYPES_H 1
 1258 | #define HAVE_SYS_MMAN_H 1
 1259 | #define HAVE_LIMITS_H 1
 1260 | #define HAVE_UNISTD_H 1
 1261 | #define HAVE_STDLIB_H 1
 1262 | #define HAVE_MALLOC 1
 1263 | #define HAVE_STDLIB_H 1
 1264 | #define HAVE_REALLOC 1
 1265 | #define HAVE_BZERO 1
 1266 | #define HAVE_MEMMOVE 1
 1267 | #define HAVE_MEMSET 1
 1268 | #define HAVE_MLOCK 1
 1269 | #define HAVE_READDIR_R 1
 1270 | #define HAVE_STRCHR 1
 1271 | #define HAVE_STRDUP 1
 1272 | #define HAVE_STRRCHR 1
 1273 | #define SIZEOF_UNSIGNED_LONG_INT 4
 1274 | #define SIZEOF_UNSIGNED_INT 4
 1275 | #define SIZEOF_UNSIGNED_SHORT_INT 2
 1276 | #define SIZEOF_UNSIGNED_CHAR 1
 1277 | #define HAVE_DLFCN_H 1
 1278 | /* end confdefs.h.  */
 1279 | #include <ac_nonexistent.h>
 1280 configure:10120: checking for g77
 1281 configure:10149: result: no
 1282 configure:10120: checking for f77
 1283 configure:10149: result: no
 1284 configure:10120: checking for xlf
 1285 configure:10149: result: no
 1286 configure:10120: checking for frt
 1287 configure:10149: result: no
 1288 configure:10120: checking for pgf77
 1289 configure:10149: result: no
 1290 configure:10120: checking for fort77
 1291 configure:10149: result: no
 1292 configure:10120: checking for fl32
 1293 configure:10149: result: no
 1294 configure:10120: checking for af77
 1295 configure:10149: result: no
 1296 configure:10120: checking for f90
 1297 configure:10149: result: no
 1298 configure:10120: checking for xlf90
 1299 configure:10149: result: no
 1300 configure:10120: checking for pgf90
 1301 configure:10149: result: no
 1302 configure:10120: checking for epcf90
 1303 configure:10149: result: no
 1304 configure:10120: checking for f95
 1305 configure:10136: found /usr/bin/f95
 1306 configure:10146: result: f95
 1307 configure:10161: checking for Fortran 77 compiler version
 1308 configure:10164: f95 --version </dev/null >&5
 1309 GNU Fortran 95 (GCC) 4.1.1 20070105 (Red Hat 4.1.1-51)
 1310 Copyright (C) 2006 Free Software Foundation, Inc.
 1311 
 1312 GNU Fortran comes with NO WARRANTY, to the extent permitted by law.
 1313 You may redistribute copies of GNU Fortran
 1314 under the terms of the GNU General Public License.
 1315 For more information about these matters, see the file named COPYING
 1316 
 1317 configure:10167: $? = 0
 1318 configure:10169: f95 -v </dev/null >&5
 1319 Using built-in specs.
 1320 Target: i386-redhat-linux
 1321 Configured with: ../configure --prefix=/usr --mandir=/usr/share/man --infodir=/usr/share/info --enable-shared --enable-threads=posix --enable-checking=release --with-system-zlib --enable-__cxa_atexit --disable-libunwind-exceptions --enable-libgcj-multifile --enable-languages=c,c++,objc,obj-c++,java,fortran,ada --enable-java-awt=gtk --disable-dssi --enable-plugin --with-java-home=/usr/lib/jvm/java-1.4.2-gcj-1.4.2.0/jre --with-cpu=generic --host=i386-redhat-linux
 1322 Thread model: posix
 1323 gcc version 4.1.1 20070105 (Red Hat 4.1.1-51)
 1324 configure:10172: $? = 0
 1325 configure:10174: f95 -V </dev/null >&5
 1326 f95: '-V' option must have argument
 1327 configure:10177: $? = 1
 1328 configure:10185: checking whether we are using the GNU Fortran 77 compiler
 1329 configure:10199: f95 -c  conftest.F >&5
 1330 configure:10205: $? = 0
 1331 configure:10209: test -z 
 1332 			 || test ! -s conftest.err
 1333 configure:10212: $? = 0
 1334 configure:10215: test -s conftest.o
 1335 configure:10218: $? = 0
 1336 configure:10231: result: yes
 1337 configure:10237: checking whether f95 accepts -g
 1338 configure:10249: f95 -c -g conftest.f >&5
 1339 configure:10255: $? = 0
 1340 configure:10259: test -z 
 1341 			 || test ! -s conftest.err
 1342 configure:10262: $? = 0
 1343 configure:10265: test -s conftest.o
 1344 configure:10268: $? = 0
 1345 configure:10280: result: yes
 1346 configure:10310: checking the maximum length of command line arguments
 1347 configure:10419: result: 32768
 1348 configure:10430: checking command to parse /usr/bin/nm -B output from gcc object
 1349 configure:10535: gcc -c -g -O2  conftest.c >&5
 1350 configure:10538: $? = 0
 1351 configure:10542: /usr/bin/nm -B conftest.o \| sed -n -e 's/^.*[ 	]\([ABCDGIRSTW][ABCDGIRSTW]*\)[ 	][ 	]*\([_A-Za-z][_A-Za-z0-9]*\)$/\1 \2 \2/p' \> conftest.nm
 1352 configure:10545: $? = 0
 1353 configure:10597: gcc -o conftest -g -O2   conftest.c conftstm.o >&5
 1354 configure:10600: $? = 0
 1355 configure:10638: result: ok
 1356 configure:10642: checking for objdir
 1357 configure:10657: result: .libs
 1358 configure:10747: checking for ar
 1359 configure:10763: found /usr/bin/ar
 1360 configure:10774: result: ar
 1361 configure:10827: checking for ranlib
 1362 configure:10843: found /usr/bin/ranlib
 1363 configure:10854: result: ranlib
 1364 configure:10907: checking for strip
 1365 configure:10923: found /usr/bin/strip
 1366 configure:10934: result: strip
 1367 configure:11206: checking if gcc supports -fno-rtti -fno-exceptions
 1368 configure:11224: gcc -c -g -O2  -fno-rtti -fno-exceptions conftest.c >&5
 1369 cc1: warning: command line option "-fno-rtti" is valid for C++/ObjC++ but not for C
 1370 cc1: warning: command line option "-fno-rtti" is valid for C++/ObjC++ but not for C
 1371 configure:11228: $? = 0
 1372 configure:11241: result: no
 1373 configure:11256: checking for gcc option to produce PIC
 1374 configure:11466: result: -fPIC
 1375 configure:11474: checking if gcc PIC flag -fPIC works
 1376 configure:11492: gcc -c -g -O2  -fPIC -DPIC conftest.c >&5
 1377 configure:11496: $? = 0
 1378 configure:11509: result: yes
 1379 configure:11537: checking if gcc static flag -static works
 1380 configure:11565: result: yes
 1381 configure:11575: checking if gcc supports -c -o file.o
 1382 configure:11596: gcc -c -g -O2  -o out/conftest2.o conftest.c >&5
 1383 configure:11600: $? = 0
 1384 configure:11622: result: yes
 1385 configure:11648: checking whether the gcc linker (/usr/bin/ld) supports shared libraries
 1386 configure:12606: result: yes
 1387 configure:12627: checking whether -lc should be explicitly linked in
 1388 configure:12632: gcc -c -g -O2  conftest.c >&5
 1389 configure:12635: $? = 0
 1390 configure:12650: gcc -shared conftest.o  -v -Wl,-soname -Wl,conftest -o conftest 2\>\&1 \| grep  -lc  \>/dev/null 2\>\&1
 1391 configure:12653: $? = 0
 1392 configure:12665: result: no
 1393 configure:12673: checking dynamic linker characteristics
 1394 configure:13282: result: GNU/Linux ld.so
 1395 configure:13291: checking how to hardcode library paths into programs
 1396 configure:13316: result: immediate
 1397 configure:13330: checking whether stripping libraries is possible
 1398 configure:13335: result: yes
 1399 configure:13461: checking for shl_load
 1400 configure:13518: gcc -o conftest -g -O2   conftest.c  >&5
 1401 /tmp/cc0T0H0V.o: In function `main':
 1402 /usr/src/redhat/SOURCES/x/libmcrypt-2.5.7/conftest.c:95: undefined reference to `shl_load'
 1403 /tmp/cc0T0H0V.o:(.data+0x0): undefined reference to `shl_load'
 1404 collect2: ld returned 1 exit status
 1405 configure:13524: $? = 1
 1406 configure: failed program was:
 1407 | /* confdefs.h.  */
 1408 | 
 1409 | #define PACKAGE_NAME ""
 1410 | #define PACKAGE_TARNAME ""
 1411 | #define PACKAGE_VERSION ""
 1412 | #define PACKAGE_STRING ""
 1413 | #define PACKAGE_BUGREPORT ""
 1414 | #define PACKAGE "libmcrypt"
 1415 | #define VERSION "2.5.8"
 1416 | #ifdef __cplusplus
 1417 | extern "C" void std::exit (int) throw (); using std::exit;
 1418 | #endif
 1419 | #define HAVE_DIRENT_H 1
 1420 | #define STDC_HEADERS 1
 1421 | #define HAVE_SYS_TYPES_H 1
 1422 | #define HAVE_SYS_STAT_H 1
 1423 | #define HAVE_STDLIB_H 1
 1424 | #define HAVE_STRING_H 1
 1425 | #define HAVE_MEMORY_H 1
 1426 | #define HAVE_STRINGS_H 1
 1427 | #define HAVE_INTTYPES_H 1
 1428 | #define HAVE_STDINT_H 1
 1429 | #define HAVE_UNISTD_H 1
 1430 | #define HAVE_ARGZ_H 1
 1431 | #define HAVE_BYTESWAP_H 1
 1432 | #define HAVE_DIRENT_H 1
 1433 | #define HAVE_DLFCN_H 1
 1434 | #define HAVE_ENDIAN_H 1
 1435 | #define HAVE_MALLOC_H 1
 1436 | #define HAVE_MEMORY_H 1
 1437 | #define HAVE_STDLIB_H 1
 1438 | #define HAVE_STRING_H 1
 1439 | #define HAVE_STRINGS_H 1
 1440 | #define HAVE_SYS_TYPES_H 1
 1441 | #define HAVE_SYS_MMAN_H 1
 1442 | #define HAVE_LIMITS_H 1
 1443 | #define HAVE_UNISTD_H 1
 1444 | #define HAVE_STDLIB_H 1
 1445 | #define HAVE_MALLOC 1
 1446 | #define HAVE_STDLIB_H 1
 1447 | #define HAVE_REALLOC 1
 1448 | #define HAVE_BZERO 1
 1449 | #define HAVE_MEMMOVE 1
 1450 | #define HAVE_MEMSET 1
 1451 | #define HAVE_MLOCK 1
 1452 | #define HAVE_READDIR_R 1
 1453 | #define HAVE_STRCHR 1
 1454 | #define HAVE_STRDUP 1
 1455 | #define HAVE_STRRCHR 1
 1456 | #define SIZEOF_UNSIGNED_LONG_INT 4
 1457 | #define SIZEOF_UNSIGNED_INT 4
 1458 | #define SIZEOF_UNSIGNED_SHORT_INT 2
 1459 | #define SIZEOF_UNSIGNED_CHAR 1
 1460 | #define HAVE_DLFCN_H 1
 1461 | /* end confdefs.h.  */
 1462 | /* Define shl_load to an innocuous variant, in case <limits.h> declares shl_load.
 1463 |    For example, HP-UX 11i <limits.h> declares gettimeofday.  */
 1464 | #define shl_load innocuous_shl_load
 1465 | 
 1466 | /* System header to define __stub macros and hopefully few prototypes,
 1467 |     which can conflict with char shl_load (); below.
 1468 |     Prefer <limits.h> to <assert.h> if __STDC__ is defined, since
 1469 |     <limits.h> exists even on freestanding compilers.  */
 1470 | 
 1471 | #ifdef __STDC__
 1472 | # include <limits.h>
 1473 | #else
 1474 | # include <assert.h>
 1475 | #endif
 1476 | 
 1477 | #undef shl_load
 1478 | 
 1479 | /* Override any gcc2 internal prototype to avoid an error.  */
 1480 | #ifdef __cplusplus
 1481 | extern "C"
 1482 | {
 1483 | #endif
 1484 | /* We use char because int might match the return type of a gcc2
 1485 |    builtin and then its argument prototype would still apply.  */
 1486 | char shl_load ();
 1487 | /* The GNU C library defines this for functions which it implements
 1488 |     to always fail with ENOSYS.  Some functions are actually named
 1489 |     something starting with __ and the normal name is an alias.  */
 1490 | #if defined (__stub_shl_load) || defined (__stub___shl_load)
 1491 | choke me
 1492 | #else
 1493 | char (*f) () = shl_load;
 1494 | #endif
 1495 | #ifdef __cplusplus
 1496 | }
 1497 | #endif
 1498 | 
 1499 | int
 1500 | main ()
 1501 | {
 1502 | return f != shl_load;
 1503 |   ;
 1504 |   return 0;
 1505 | }
 1506 configure:13549: result: no
 1507 configure:13554: checking for shl_load in -ldld
 1508 configure:13584: gcc -o conftest -g -O2   conftest.c -ldld   >&5
 1509 /usr/bin/ld: cannot find -ldld
 1510 collect2: ld returned 1 exit status
 1511 configure:13590: $? = 1
 1512 configure: failed program was:
 1513 | /* confdefs.h.  */
 1514 | 
 1515 | #define PACKAGE_NAME ""
 1516 | #define PACKAGE_TARNAME ""
 1517 | #define PACKAGE_VERSION ""
 1518 | #define PACKAGE_STRING ""
 1519 | #define PACKAGE_BUGREPORT ""
 1520 | #define PACKAGE "libmcrypt"
 1521 | #define VERSION "2.5.8"
 1522 | #ifdef __cplusplus
 1523 | extern "C" void std::exit (int) throw (); using std::exit;
 1524 | #endif
 1525 | #define HAVE_DIRENT_H 1
 1526 | #define STDC_HEADERS 1
 1527 | #define HAVE_SYS_TYPES_H 1
 1528 | #define HAVE_SYS_STAT_H 1
 1529 | #define HAVE_STDLIB_H 1
 1530 | #define HAVE_STRING_H 1
 1531 | #define HAVE_MEMORY_H 1
 1532 | #define HAVE_STRINGS_H 1
 1533 | #define HAVE_INTTYPES_H 1
 1534 | #define HAVE_STDINT_H 1
 1535 | #define HAVE_UNISTD_H 1
 1536 | #define HAVE_ARGZ_H 1
 1537 | #define HAVE_BYTESWAP_H 1
 1538 | #define HAVE_DIRENT_H 1
 1539 | #define HAVE_DLFCN_H 1
 1540 | #define HAVE_ENDIAN_H 1
 1541 | #define HAVE_MALLOC_H 1
 1542 | #define HAVE_MEMORY_H 1
 1543 | #define HAVE_STDLIB_H 1
 1544 | #define HAVE_STRING_H 1
 1545 | #define HAVE_STRINGS_H 1
 1546 | #define HAVE_SYS_TYPES_H 1
 1547 | #define HAVE_SYS_MMAN_H 1
 1548 | #define HAVE_LIMITS_H 1
 1549 | #define HAVE_UNISTD_H 1
 1550 | #define HAVE_STDLIB_H 1
 1551 | #define HAVE_MALLOC 1
 1552 | #define HAVE_STDLIB_H 1
 1553 | #define HAVE_REALLOC 1
 1554 | #define HAVE_BZERO 1
 1555 | #define HAVE_MEMMOVE 1
 1556 | #define HAVE_MEMSET 1
 1557 | #define HAVE_MLOCK 1
 1558 | #define HAVE_READDIR_R 1
 1559 | #define HAVE_STRCHR 1
 1560 | #define HAVE_STRDUP 1
 1561 | #define HAVE_STRRCHR 1
 1562 | #define SIZEOF_UNSIGNED_LONG_INT 4
 1563 | #define SIZEOF_UNSIGNED_INT 4
 1564 | #define SIZEOF_UNSIGNED_SHORT_INT 2
 1565 | #define SIZEOF_UNSIGNED_CHAR 1
 1566 | #define HAVE_DLFCN_H 1
 1567 | /* end confdefs.h.  */
 1568 | 
 1569 | /* Override any gcc2 internal prototype to avoid an error.  */
 1570 | #ifdef __cplusplus
 1571 | extern "C"
 1572 | #endif
 1573 | /* We use char because int might match the return type of a gcc2
 1574 |    builtin and then its argument prototype would still apply.  */
 1575 | char shl_load ();
 1576 | int
 1577 | main ()
 1578 | {
 1579 | shl_load ();
 1580 |   ;
 1581 |   return 0;
 1582 | }
 1583 configure:13616: result: no
 1584 configure:13621: checking for dlopen
 1585 configure:13678: gcc -o conftest -g -O2   conftest.c  >&5
 1586 /tmp/ccwQbtVo.o: In function `main':
 1587 /usr/src/redhat/SOURCES/x/libmcrypt-2.5.7/conftest.c:95: undefined reference to `dlopen'
 1588 /tmp/ccwQbtVo.o:(.data+0x0): undefined reference to `dlopen'
 1589 collect2: ld returned 1 exit status
 1590 configure:13684: $? = 1
 1591 configure: failed program was:
 1592 | /* confdefs.h.  */
 1593 | 
 1594 | #define PACKAGE_NAME ""
 1595 | #define PACKAGE_TARNAME ""
 1596 | #define PACKAGE_VERSION ""
 1597 | #define PACKAGE_STRING ""
 1598 | #define PACKAGE_BUGREPORT ""
 1599 | #define PACKAGE "libmcrypt"
 1600 | #define VERSION "2.5.8"
 1601 | #ifdef __cplusplus
 1602 | extern "C" void std::exit (int) throw (); using std::exit;
 1603 | #endif
 1604 | #define HAVE_DIRENT_H 1
 1605 | #define STDC_HEADERS 1
 1606 | #define HAVE_SYS_TYPES_H 1
 1607 | #define HAVE_SYS_STAT_H 1
 1608 | #define HAVE_STDLIB_H 1
 1609 | #define HAVE_STRING_H 1
 1610 | #define HAVE_MEMORY_H 1
 1611 | #define HAVE_STRINGS_H 1
 1612 | #define HAVE_INTTYPES_H 1
 1613 | #define HAVE_STDINT_H 1
 1614 | #define HAVE_UNISTD_H 1
 1615 | #define HAVE_ARGZ_H 1
 1616 | #define HAVE_BYTESWAP_H 1
 1617 | #define HAVE_DIRENT_H 1
 1618 | #define HAVE_DLFCN_H 1
 1619 | #define HAVE_ENDIAN_H 1
 1620 | #define HAVE_MALLOC_H 1
 1621 | #define HAVE_MEMORY_H 1
 1622 | #define HAVE_STDLIB_H 1
 1623 | #define HAVE_STRING_H 1
 1624 | #define HAVE_STRINGS_H 1
 1625 | #define HAVE_SYS_TYPES_H 1
 1626 | #define HAVE_SYS_MMAN_H 1
 1627 | #define HAVE_LIMITS_H 1
 1628 | #define HAVE_UNISTD_H 1
 1629 | #define HAVE_STDLIB_H 1
 1630 | #define HAVE_MALLOC 1
 1631 | #define HAVE_STDLIB_H 1
 1632 | #define HAVE_REALLOC 1
 1633 | #define HAVE_BZERO 1
 1634 | #define HAVE_MEMMOVE 1
 1635 | #define HAVE_MEMSET 1
 1636 | #define HAVE_MLOCK 1
 1637 | #define HAVE_READDIR_R 1
 1638 | #define HAVE_STRCHR 1
 1639 | #define HAVE_STRDUP 1
 1640 | #define HAVE_STRRCHR 1
 1641 | #define SIZEOF_UNSIGNED_LONG_INT 4
 1642 | #define SIZEOF_UNSIGNED_INT 4
 1643 | #define SIZEOF_UNSIGNED_SHORT_INT 2
 1644 | #define SIZEOF_UNSIGNED_CHAR 1
 1645 | #define HAVE_DLFCN_H 1
 1646 | /* end confdefs.h.  */
 1647 | /* Define dlopen to an innocuous variant, in case <limits.h> declares dlopen.
 1648 |    For example, HP-UX 11i <limits.h> declares gettimeofday.  */
 1649 | #define dlopen innocuous_dlopen
 1650 | 
 1651 | /* System header to define __stub macros and hopefully few prototypes,
 1652 |     which can conflict with char dlopen (); below.
 1653 |     Prefer <limits.h> to <assert.h> if __STDC__ is defined, since
 1654 |     <limits.h> exists even on freestanding compilers.  */
 1655 | 
 1656 | #ifdef __STDC__
 1657 | # include <limits.h>
 1658 | #else
 1659 | # include <assert.h>
 1660 | #endif
 1661 | 
 1662 | #undef dlopen
 1663 | 
 1664 | /* Override any gcc2 internal prototype to avoid an error.  */
 1665 | #ifdef __cplusplus
 1666 | extern "C"
 1667 | {
 1668 | #endif
 1669 | /* We use char because int might match the return type of a gcc2
 1670 |    builtin and then its argument prototype would still apply.  */
 1671 | char dlopen ();
 1672 | /* The GNU C library defines this for functions which it implements
 1673 |     to always fail with ENOSYS.  Some functions are actually named
 1674 |     something starting with __ and the normal name is an alias.  */
 1675 | #if defined (__stub_dlopen) || defined (__stub___dlopen)
 1676 | choke me
 1677 | #else
 1678 | char (*f) () = dlopen;
 1679 | #endif
 1680 | #ifdef __cplusplus
 1681 | }
 1682 | #endif
 1683 | 
 1684 | int
 1685 | main ()
 1686 | {
 1687 | return f != dlopen;
 1688 |   ;
 1689 |   return 0;
 1690 | }
 1691 configure:13709: result: no
 1692 configure:13714: checking for dlopen in -ldl
 1693 configure:13744: gcc -o conftest -g -O2   conftest.c -ldl   >&5
 1694 configure:13750: $? = 0
 1695 configure:13754: test -z 
 1696 			 || test ! -s conftest.err
 1697 configure:13757: $? = 0
 1698 configure:13760: test -s conftest
 1699 configure:13763: $? = 0
 1700 configure:13776: result: yes
 1701 configure:13951: checking whether a program can dlopen itself
 1702 configure:14025: gcc -o conftest -g -O2  -DHAVE_DLFCN_H  -Wl,--export-dynamic conftest.c -ldl  >&5
 1703 configure: In function 'main':
 1704 configure:14021: warning: incompatible implicit declaration of built-in function 'exit'
 1705 configure:14028: $? = 0
 1706 configure:14046: result: yes
 1707 configure:14051: checking whether a statically linked program can dlopen itself
 1708 configure:14125: gcc -o conftest -g -O2  -DHAVE_DLFCN_H  -Wl,--export-dynamic -static conftest.c -ldl  >&5
 1709 configure: In function 'main':
 1710 configure:14121: warning: incompatible implicit declaration of built-in function 'exit'
 1711 /tmp/ccZfLCmj.o: In function `main':
 1712 /usr/src/redhat/SOURCES/x/libmcrypt-2.5.7/configure:14109: warning: Using 'dlopen' in statically linked applications requires at runtime the shared libraries from the glibc version used for linking
 1713 configure:14128: $? = 0
 1714 /lib/: cannot read file data: Is a directory
 1715 configure:14146: result: no
 1716 configure:14169: checking if libtool supports shared libraries
 1717 configure:14171: result: yes
 1718 configure:14174: checking whether to build shared libraries
 1719 configure:14195: result: yes
 1720 configure:14198: checking whether to build static libraries
 1721 configure:14202: result: yes
 1722 configure:14294: creating libtool
 1723 configure:14885: checking for ld used by g++
 1724 configure:14952: result: /usr/bin/ld
 1725 configure:14961: checking if the linker (/usr/bin/ld) is GNU ld
 1726 configure:14976: result: yes
 1727 configure:15027: checking whether the g++ linker (/usr/bin/ld) supports shared libraries
 1728 configure:15965: result: yes
 1729 configure:15983: g++ -c -g -O2  conftest.cpp >&5
 1730 configure:15986: $? = 0
 1731 configure:16105: checking for g++ option to produce PIC
 1732 configure:16379: result: -fPIC
 1733 configure:16387: checking if g++ PIC flag -fPIC works
 1734 configure:16405: g++ -c -g -O2  -fPIC -DPIC conftest.cpp >&5
 1735 configure:16409: $? = 0
 1736 configure:16422: result: yes
 1737 configure:16450: checking if g++ static flag -static works
 1738 configure:16478: result: yes
 1739 configure:16488: checking if g++ supports -c -o file.o
 1740 configure:16509: g++ -c -g -O2  -o out/conftest2.o conftest.cpp >&5
 1741 configure:16513: $? = 0
 1742 configure:16535: result: yes
 1743 configure:16561: checking whether the g++ linker (/usr/bin/ld) supports shared libraries
 1744 configure:16586: result: yes
 1745 configure:16653: checking dynamic linker characteristics
 1746 configure:17262: result: GNU/Linux ld.so
 1747 configure:17271: checking how to hardcode library paths into programs
 1748 configure:17296: result: immediate
 1749 configure:17825: checking if libtool supports shared libraries
 1750 configure:17827: result: yes
 1751 configure:17830: checking whether to build shared libraries
 1752 configure:17850: result: yes
 1753 configure:17853: checking whether to build static libraries
 1754 configure:17857: result: yes
 1755 configure:17867: checking for f95 option to produce PIC
 1756 configure:18077: result: -fPIC
 1757 configure:18085: checking if f95 PIC flag -fPIC works
 1758 configure:18103: f95 -c -g -O2 -fPIC conftest.f >&5
 1759 configure:18107: $? = 0
 1760 configure:18120: result: yes
 1761 configure:18148: checking if f95 static flag -static works
 1762 configure:18176: result: yes
 1763 configure:18186: checking if f95 supports -c -o file.o
 1764 configure:18207: f95 -c -g -O2 -o out/conftest2.o conftest.f >&5
 1765 configure:18211: $? = 0
 1766 configure:18233: result: yes
 1767 configure:18259: checking whether the f95 linker (/usr/bin/ld) supports shared libraries
 1768 configure:19197: result: yes
 1769 configure:19264: checking dynamic linker characteristics
 1770 configure:19873: result: GNU/Linux ld.so
 1771 configure:19882: checking how to hardcode library paths into programs
 1772 configure:19907: result: immediate
 1773 configure:23636: creating ./config.status
 1774 
 1775 ## ---------------------- ##
 1776 ## Running config.status. ##
 1777 ## ---------------------- ##
 1778 
 1779 This file was extended by config.status, which was
 1780 generated by GNU Autoconf 2.59.  Invocation command line was
 1781 
 1782   CONFIG_FILES    = 
 1783   CONFIG_HEADERS  = 
 1784   CONFIG_LINKS    = 
 1785   CONFIG_COMMANDS = 
 1786   $ ./config.status 
 1787 
 1788 on localhost.localdomain
 1789 
 1790 config.status:763: creating Makefile
 1791 config.status:763: creating libmcrypt.spec
 1792 config.status:763: creating lib/Makefile
 1793 config.status:763: creating doc/Makefile
 1794 config.status:763: creating src/Makefile
 1795 config.status:763: creating include/mutils/mcrypt.h
 1796 config.status:763: creating include/Makefile
 1797 config.status:763: creating modules/Makefile
 1798 config.status:763: creating modules/modes/Makefile
 1799 config.status:763: creating modules/algorithms/Makefile
 1800 config.status:763: creating lib/libmcrypt-config
 1801 config.status:867: creating config.h
 1802 config.status:1235: executing depfiles commands
 1803 config.status:1235: executing default-1 commands
 1804 
 1805 ## ---------------- ##
 1806 ## Cache variables. ##
 1807 ## ---------------- ##
 1808 
 1809 ac_cv_build=i686-redhat-linux-gnu
 1810 ac_cv_build_alias=i686-redhat-linux-gnu
 1811 ac_cv_c_bigendian=no
 1812 ac_cv_c_compiler_gnu=yes
 1813 ac_cv_c_const=yes
 1814 ac_cv_c_inline=inline
 1815 ac_cv_cxx_compiler_gnu=yes
 1816 ac_cv_env_CC_set=
 1817 ac_cv_env_CC_value=
 1818 ac_cv_env_CFLAGS_set=
 1819 ac_cv_env_CFLAGS_value=
 1820 ac_cv_env_CPPFLAGS_set=
 1821 ac_cv_env_CPPFLAGS_value=
 1822 ac_cv_env_CPP_set=
 1823 ac_cv_env_CPP_value=
 1824 ac_cv_env_CXXCPP_set=
 1825 ac_cv_env_CXXCPP_value=
 1826 ac_cv_env_CXXFLAGS_set=
 1827 ac_cv_env_CXXFLAGS_value=
 1828 ac_cv_env_CXX_set=
 1829 ac_cv_env_CXX_value=
 1830 ac_cv_env_F77_set=
 1831 ac_cv_env_F77_value=
 1832 ac_cv_env_FFLAGS_set=
 1833 ac_cv_env_FFLAGS_value=
 1834 ac_cv_env_LDFLAGS_set=
 1835 ac_cv_env_LDFLAGS_value=
 1836 ac_cv_env_build_alias_set=
 1837 ac_cv_env_build_alias_value=
 1838 ac_cv_env_host_alias_set=
 1839 ac_cv_env_host_alias_value=
 1840 ac_cv_env_target_alias_set=
 1841 ac_cv_env_target_alias_value=
 1842 ac_cv_exeext=
 1843 ac_cv_f77_compiler_gnu=yes
 1844 ac_cv_func_bcopy__=no
 1845 ac_cv_func_bzero=yes
 1846 ac_cv_func_closedir_void=no
 1847 ac_cv_func_dlopen=no
 1848 ac_cv_func_malloc_0_nonnull=yes
 1849 ac_cv_func_memcmp_working=yes
 1850 ac_cv_func_memmove=yes
 1851 ac_cv_func_memset=yes
 1852 ac_cv_func_mlock=yes
 1853 ac_cv_func_readdir__=no
 1854 ac_cv_func_readdir_r=yes
 1855 ac_cv_func_realloc_0_nonnull=yes
 1856 ac_cv_func_shl_load=no
 1857 ac_cv_func_strchr=yes
 1858 ac_cv_func_strdup=yes
 1859 ac_cv_func_strrchr=yes
 1860 ac_cv_header_argz_h=yes
 1861 ac_cv_header_byteswap_h=yes
 1862 ac_cv_header_dirent_dirent_h=yes
 1863 ac_cv_header_dirent_h=yes
 1864 ac_cv_header_dlfcn_h=yes
 1865 ac_cv_header_endian_h=yes
 1866 ac_cv_header_inttypes_h=yes
 1867 ac_cv_header_limits_h=yes
 1868 ac_cv_header_malloc_h=yes
 1869 ac_cv_header_memory_h=yes
 1870 ac_cv_header_stdc=yes
 1871 ac_cv_header_stdint_h=yes
 1872 ac_cv_header_stdlib_h=yes
 1873 ac_cv_header_string_h=yes
 1874 ac_cv_header_strings_h=yes
 1875 ac_cv_header_sys_endian_h=no
 1876 ac_cv_header_sys_mman_h=yes
 1877 ac_cv_header_sys_stat_h=yes
 1878 ac_cv_header_sys_types_h=yes
 1879 ac_cv_header_unistd_h=yes
 1880 ac_cv_host=i686-redhat-linux-gnu
 1881 ac_cv_host_alias=i686-redhat-linux-gnu
 1882 ac_cv_lib_dl_dlopen=yes
 1883 ac_cv_lib_dld_shl_load=no
 1884 ac_cv_objext=o
 1885 ac_cv_path_install='/usr/bin/install -c'
 1886 ac_cv_prog_AWK=gawk
 1887 ac_cv_prog_CPP='gcc -E'
 1888 ac_cv_prog_CXXCPP='g++ -E'
 1889 ac_cv_prog_ac_ct_AR=ar
 1890 ac_cv_prog_ac_ct_CC=gcc
 1891 ac_cv_prog_ac_ct_CXX=g++
 1892 ac_cv_prog_ac_ct_F77=f95
 1893 ac_cv_prog_ac_ct_RANLIB=ranlib
 1894 ac_cv_prog_ac_ct_STRIP=strip
 1895 ac_cv_prog_cc_g=yes
 1896 ac_cv_prog_cc_stdc=
 1897 ac_cv_prog_cxx_g=yes
 1898 ac_cv_prog_egrep='grep -E'
 1899 ac_cv_prog_f77_g=yes
 1900 ac_cv_prog_make_make_set=yes
 1901 ac_cv_search_opendir='none required'
 1902 ac_cv_sizeof_unsigned_char=1
 1903 ac_cv_sizeof_unsigned_int=4
 1904 ac_cv_sizeof_unsigned_long_int=4
 1905 ac_cv_sizeof_unsigned_short_int=2
 1906 ac_cv_target=i686-redhat-linux-gnu
 1907 ac_cv_target_alias=i686-redhat-linux-gnu
 1908 ac_cv_type_unsigned_char=yes
 1909 ac_cv_type_unsigned_int=yes
 1910 ac_cv_type_unsigned_long_int=yes
 1911 ac_cv_type_unsigned_short_int=yes
 1912 am_cv_CC_dependencies_compiler_type=gcc3
 1913 am_cv_CXX_dependencies_compiler_type=gcc3
 1914 lt_cv_deplibs_check_method=pass_all
 1915 lt_cv_dlopen=dlopen
 1916 lt_cv_dlopen_libs=-ldl
 1917 lt_cv_dlopen_self=yes
 1918 lt_cv_dlopen_self_static=no
 1919 lt_cv_file_magic_cmd='$MAGIC_CMD'
 1920 lt_cv_file_magic_test_file=
 1921 lt_cv_ld_reload_flag=-r
 1922 lt_cv_objdir=.libs
 1923 lt_cv_path_LD=/usr/bin/ld
 1924 lt_cv_path_LDCXX=/usr/bin/ld
 1925 lt_cv_path_NM='/usr/bin/nm -B'
 1926 lt_cv_path_SED=/bin/sed
 1927 lt_cv_prog_compiler_c_o=yes
 1928 lt_cv_prog_compiler_c_o_CXX=yes
 1929 lt_cv_prog_compiler_c_o_F77=yes
 1930 lt_cv_prog_compiler_rtti_exceptions=no
 1931 lt_cv_prog_gnu_ld=yes
 1932 lt_cv_prog_gnu_ldcxx=yes
 1933 lt_cv_sys_global_symbol_pipe='sed -n -e '\''s/^.*[ 	]\([ABCDGIRSTW][ABCDGIRSTW]*\)[ 	][ 	]*\([_A-Za-z][_A-Za-z0-9]*\)$/\1 \2 \2/p'\'''
 1934 lt_cv_sys_global_symbol_to_c_name_address='sed -n -e '\''s/^: \([^ ]*\) $/  {\"\1\", (lt_ptr) 0},/p'\'' -e '\''s/^[BCDEGRST] \([^ ]*\) \([^ ]*\)$/  {"\2", (lt_ptr) \&\2},/p'\'''
 1935 lt_cv_sys_global_symbol_to_cdecl='sed -n -e '\''s/^. .* \(.*\)$/extern int \1;/p'\'''
 1936 lt_cv_sys_max_cmd_len=32768
 1937 lt_lt_cv_prog_compiler_c_o='"yes"'
 1938 lt_lt_cv_prog_compiler_c_o_CXX='"yes"'
 1939 lt_lt_cv_prog_compiler_c_o_F77='"yes"'
 1940 lt_lt_cv_sys_global_symbol_pipe='"sed -n -e '\''s/^.*[ 	]\\([ABCDGIRSTW][ABCDGIRSTW]*\\)[ 	][ 	]*\\([_A-Za-z][_A-Za-z0-9]*\\)\$/\\1 \\2 \\2/p'\''"'
 1941 lt_lt_cv_sys_global_symbol_to_c_name_address='"sed -n -e '\''s/^: \\([^ ]*\\) \$/  {\\\"\\1\\\", (lt_ptr) 0},/p'\'' -e '\''s/^[BCDEGRST] \\([^ ]*\\) \\([^ ]*\\)\$/  {\"\\2\", (lt_ptr) \\&\\2},/p'\''"'
 1942 lt_lt_cv_sys_global_symbol_to_cdecl='"sed -n -e '\''s/^. .* \\(.*\\)\$/extern int \\1;/p'\''"'
 1943 
 1944 ## ----------------- ##
 1945 ## Output variables. ##
 1946 ## ----------------- ##
 1947 
 1948 ACLOCAL='${SHELL} /usr/src/redhat/SOURCES/x/libmcrypt-2.5.7/missing --run aclocal-1.9'
 1949 AMDEPBACKSLASH='\'
 1950 AMDEP_FALSE='#'
 1951 AMDEP_TRUE=''
 1952 AMTAR='${SHELL} /usr/src/redhat/SOURCES/x/libmcrypt-2.5.7/missing --run tar'
 1953 AR='ar'
 1954 AS='as'
 1955 AUTOCONF='${SHELL} /usr/src/redhat/SOURCES/x/libmcrypt-2.5.7/missing --run autoconf'
 1956 AUTOHEADER='${SHELL} /usr/src/redhat/SOURCES/x/libmcrypt-2.5.7/missing --run autoheader'
 1957 AUTOMAKE='${SHELL} /usr/src/redhat/SOURCES/x/libmcrypt-2.5.7/missing --run automake-1.9'
 1958 AWK='gawk'
 1959 CC='gcc'
 1960 CCDEPMODE='depmode=gcc3'
 1961 CFLAGS='-g -O2'
 1962 CPP='gcc -E'
 1963 CPPFLAGS=''
 1964 CXX='g++'
 1965 CXXCPP='g++ -E'
 1966 CXXDEPMODE='depmode=gcc3'
 1967 CXXFLAGS='-g -O2'
 1968 CYGPATH_W='echo'
 1969 DEFS='-DHAVE_CONFIG_H'
 1970 DEPDIR='.deps'
 1971 DLLTOOL='dlltool'
 1972 ECHO='echo'
 1973 ECHO_C=''
 1974 ECHO_N='-n'
 1975 ECHO_T=''
 1976 EGREP='grep -E'
 1977 EXEEXT=''
 1978 EXTRA_ALGOS='cbc cfb ctr ecb ncfb nofb ofb stream threeway cast-128 gost rijndael-128 safer-sk64 twofish arcfour cast-256 loki97 rijndael-192 saferplus wake blowfish-compat des rijndael-256 serpent xtea blowfish enigma rc2 safer-sk128 tripledes'
 1979 EXTRA_OBJECTS=' ../modules/modes/cbc.lo ../modules/modes/cfb.lo ../modules/modes/ctr.lo ../modules/modes/ecb.lo ../modules/modes/ncfb.lo ../modules/modes/nofb.lo ../modules/modes/ofb.lo ../modules/modes/stream.lo ../modules/algorithms/cast-128.lo ../modules/algorithms/gost.lo ../modules/algorithms/rijndael-128.lo ../modules/algorithms/twofish.lo ../modules/algorithms/arcfour.lo ../modules/algorithms/cast-256.lo ../modules/algorithms/loki97.lo ../modules/algorithms/rijndael-192.lo ../modules/algorithms/saferplus.lo ../modules/algorithms/wake.lo ../modules/algorithms/blowfish-compat.lo ../modules/algorithms/des.lo ../modules/algorithms/rijndael-256.lo ../modules/algorithms/serpent.lo ../modules/algorithms/xtea.lo ../modules/algorithms/blowfish.lo ../modules/algorithms/enigma.lo ../modules/algorithms/rc2.lo ../modules/algorithms/tripledes.lo'
 1980 F77='f95'
 1981 FFLAGS='-g -O2'
 1982 INCLTDL=''
 1983 INSTALL_ALGORITHM_MODULES=''
 1984 INSTALL_DATA='${INSTALL} -m 644'
 1985 INSTALL_MODE_MODULES=''
 1986 INSTALL_PROGRAM='${INSTALL}'
 1987 INSTALL_SCRIPT='${INSTALL}'
 1988 INSTALL_STRIP_PROGRAM='${SHELL} $(install_sh) -c -s'
 1989 LDFLAGS=''
 1990 LIBLTDL=''
 1991 LIBLTDL_DIR=''
 1992 LIBMCRYPT_CFLAGS='-I${prefix}/include'
 1993 LIBMCRYPT_CURRENT_INTERFACE_IMPLEMENTATION_NUMBER='8'
 1994 LIBMCRYPT_LIBS=' -L${exec_prefix}/lib -lmcrypt '
 1995 LIBMCRYPT_MAJOR_VERSION='2'
 1996 LIBMCRYPT_MICRO_VERSION='8'
 1997 LIBMCRYPT_MINOR_VERSION='5'
 1998 LIBMCRYPT_MOST_RECENT_INTERFACE='8'
 1999 LIBMCRYPT_OLDEST_INTERFACE='4'
 2000 LIBMCRYPT_VERSION='2.5.8'
 2001 LIBOBJS=''
 2002 LIBS=''
 2003 LIBTOOL='$(SHELL) $(top_builddir)/libtool'
 2004 LIBTOOL_DEPS='./ltmain.sh'
 2005 LN_S='ln -s'
 2006 LTLIBOBJS=''
 2007 LT_AGE='4'
 2008 LT_CURRENT='8'
 2009 LT_REVISION='8'
 2010 MAINT='#'
 2011 MAINTAINER_MODE_FALSE=''
 2012 MAINTAINER_MODE_TRUE='#'
 2013 MAKEINFO='${SHELL} /usr/src/redhat/SOURCES/x/libmcrypt-2.5.7/missing --run makeinfo'
 2014 NOINSTALL_ALGORITHM_MODULES=' threeway.la cast-128.la gost.la rijndael-128.la safer-sk64.la twofish.la arcfour.la cast-256.la loki97.la rijndael-192.la saferplus.la wake.la blowfish-compat.la des.la rijndael-256.la serpent.la xtea.la blowfish.la enigma.la rc2.la safer-sk128.la tripledes.la'
 2015 NOINSTALL_MODE_MODULES=' cbc.la cfb.la ctr.la ecb.la ncfb.la nofb.la ofb.la stream.la'
 2016 OBJDUMP='objdump'
 2017 OBJEXT='o'
 2018 PACKAGE='libmcrypt'
 2019 PACKAGE_BUGREPORT=''
 2020 PACKAGE_NAME=''
 2021 PACKAGE_STRING=''
 2022 PACKAGE_TARNAME=''
 2023 PACKAGE_VERSION=''
 2024 PATH_SEPARATOR=':'
 2025 RANLIB='ranlib'
 2026 SED='/bin/sed'
 2027 SET_MAKE=''
 2028 SHELL='/bin/sh'
 2029 STRIP='strip'
 2030 VERSION='2.5.8'
 2031 ac_ct_AR='ar'
 2032 ac_ct_AS=''
 2033 ac_ct_CC='gcc'
 2034 ac_ct_CXX='g++'
 2035 ac_ct_DLLTOOL=''
 2036 ac_ct_F77='f95'
 2037 ac_ct_OBJDUMP=''
 2038 ac_ct_RANLIB='ranlib'
 2039 ac_ct_STRIP='strip'
 2040 am__fastdepCC_FALSE='#'
 2041 am__fastdepCC_TRUE=''
 2042 am__fastdepCXX_FALSE='#'
 2043 am__fastdepCXX_TRUE=''
 2044 am__include='include'
 2045 am__leading_dot='.'
 2046 am__quote=''
 2047 am__tar='${AMTAR} chof - "$$tardir"'
 2048 am__untar='${AMTAR} xf -'
 2049 bindir='${exec_prefix}/bin'
 2050 build='i686-redhat-linux-gnu'
 2051 build_alias=''
 2052 build_cpu='i686'
 2053 build_os='linux-gnu'
 2054 build_vendor='redhat'
 2055 datadir='${prefix}/share'
 2056 exec_prefix='${prefix}'
 2057 host='i686-redhat-linux-gnu'
 2058 host_alias=''
 2059 host_cpu='i686'
 2060 host_os='linux-gnu'
 2061 host_vendor='redhat'
 2062 includedir='${prefix}/include'
 2063 infodir='${prefix}/info'
 2064 install_sh='/usr/src/redhat/SOURCES/x/libmcrypt-2.5.7/install-sh'
 2065 libdir='${exec_prefix}/lib'
 2066 libexecdir='${exec_prefix}/libexec'
 2067 localstatedir='${prefix}/var'
 2068 mandir='${prefix}/man'
 2069 mkdir_p='mkdir -p --'
 2070 oldincludedir='/usr/include'
 2071 prefix='/usr'
 2072 program_transform_name='s,x,x,'
 2073 sbindir='${exec_prefix}/sbin'
 2074 sharedstatedir='${prefix}/com'
 2075 subdirs=''
 2076 sysconfdir='${prefix}/etc'
 2077 target='i686-redhat-linux-gnu'
 2078 target_alias=''
 2079 target_cpu='i686'
 2080 target_os='linux-gnu'
 2081 target_vendor='redhat'
 2082 
 2083 ## ----------- ##
 2084 ## confdefs.h. ##
 2085 ## ----------- ##
 2086 
 2087 #define HAVE_ARGZ_H 1
 2088 #define HAVE_BYTESWAP_H 1
 2089 #define HAVE_BZERO 1
 2090 #define HAVE_DIRENT_H 1
 2091 #define HAVE_DIRENT_H 1
 2092 #define HAVE_DLFCN_H 1
 2093 #define HAVE_DLFCN_H 1
 2094 #define HAVE_ENDIAN_H 1
 2095 #define HAVE_INTTYPES_H 1
 2096 #define HAVE_LIMITS_H 1
 2097 #define HAVE_MALLOC 1
 2098 #define HAVE_MALLOC_H 1
 2099 #define HAVE_MEMMOVE 1
 2100 #define HAVE_MEMORY_H 1
 2101 #define HAVE_MEMORY_H 1
 2102 #define HAVE_MEMSET 1
 2103 #define HAVE_MLOCK 1
 2104 #define HAVE_READDIR_R 1
 2105 #define HAVE_REALLOC 1
 2106 #define HAVE_STDINT_H 1
 2107 #define HAVE_STDLIB_H 1
 2108 #define HAVE_STDLIB_H 1
 2109 #define HAVE_STDLIB_H 1
 2110 #define HAVE_STDLIB_H 1
 2111 #define HAVE_STRCHR 1
 2112 #define HAVE_STRDUP 1
 2113 #define HAVE_STRINGS_H 1
 2114 #define HAVE_STRINGS_H 1
 2115 #define HAVE_STRING_H 1
 2116 #define HAVE_STRING_H 1
 2117 #define HAVE_STRRCHR 1
 2118 #define HAVE_SYS_MMAN_H 1
 2119 #define HAVE_SYS_STAT_H 1
 2120 #define HAVE_SYS_TYPES_H 1
 2121 #define HAVE_SYS_TYPES_H 1
 2122 #define HAVE_UNISTD_H 1
 2123 #define HAVE_UNISTD_H 1
 2124 #define PACKAGE "libmcrypt"
 2125 #define PACKAGE_BUGREPORT ""
 2126 #define PACKAGE_NAME ""
 2127 #define PACKAGE_STRING ""
 2128 #define PACKAGE_TARNAME ""
 2129 #define PACKAGE_VERSION ""
 2130 #define SIZEOF_UNSIGNED_CHAR 1
 2131 #define SIZEOF_UNSIGNED_INT 4
 2132 #define SIZEOF_UNSIGNED_LONG_INT 4
 2133 #define SIZEOF_UNSIGNED_SHORT_INT 2
 2134 #define STDC_HEADERS 1
 2135 #define VERSION "2.5.8"
 2136 #endif
 2137 #ifdef __cplusplus
 2138 extern "C" void std::exit (int) throw (); using std::exit;
 2139 
 2140 configure: exit 0