"Fossies" - the Fresh Open Source Software Archive  

Source code changes of the file "regex-0.13/config.log" between
bed-3.1.0.src.tar.xz and bed-3.1.1.src.tar.xz

About: bed is an adjustable data format binary editor.

config.log  (bed-3.1.0.src.tar.xz):config.log  (bed-3.1.1.src.tar.xz)
This file contains any messages produced by compilers while This file contains any messages produced by compilers while
running configure, to aid debugging if configure makes a mistake. running configure, to aid debugging if configure makes a mistake.
It was created by configure, which was It was created by configure, which was
generated by GNU Autoconf 2.69. Invocation command line was generated by GNU Autoconf 2.69. Invocation command line was
$ ./configure --disable-option-checking --prefix=/usr/local CFLAGS=-m32 CXXFLA GS=-m32 LDFLAGS=-m32 --cache-file=/dev/null --srcdir=. $ ./configure --disable-option-checking --prefix=/mingw64 --cache-file=/dev/nu ll --srcdir=.
## --------- ## ## --------- ##
## Platform. ## ## Platform. ##
## --------- ## ## --------- ##
hostname = i7 hostname = DESKTOP-442N72S
uname -m = x86_64 uname -m = x86_64
uname -r = 5.8.0-53-generic uname -r = 3.2.0-340.x86_64
uname -s = Linux uname -s = MINGW64_NT-10.0-19042
uname -v = #60-Ubuntu SMP Thu May 6 07:46:32 UTC 2021 uname -v = 2021-04-02 09:40 UTC
/usr/bin/uname -p = unknown /usr/bin/uname -p = unknown
/bin/uname -X = unknown /bin/uname -X = unknown
/bin/arch = unknown /bin/arch = x86_64
/usr/bin/arch -k = unknown /usr/bin/arch -k = unknown
/usr/convex/getsysinfo = unknown /usr/convex/getsysinfo = unknown
/usr/bin/hostinfo = unknown /usr/bin/hostinfo = unknown
/bin/machine = unknown /bin/machine = unknown
/usr/bin/oslevel = unknown /usr/bin/oslevel = unknown
/bin/universe = unknown /bin/universe = unknown
PATH: /home/jka/Android/Sdk/ndk/22.1.7171670/toolchains/llvm/prebuilt/linux-x86_ PATH: /mingw64/bin
64/bin
PATH: /home/jka/bin
PATH: /usr/local/sbin
PATH: /usr/local/bin PATH: /usr/local/bin
PATH: /usr/sbin
PATH: /usr/bin PATH: /usr/bin
PATH: /sbin
PATH: /bin PATH: /bin
PATH: /snap/bin PATH: /c/Windows/System32
PATH: /home/jka/.Garmin/ConnectIQ/Sdks/connectiq-sdk-lin-3.2.3-2020-10-13-c14e60 PATH: /c/Windows
9bd/bin PATH: /c/Windows/System32/Wbem
PATH: /home/jka/Android/Sdk/platform-tools PATH: /c/Windows/System32/WindowsPowerShell/v1.0/
PATH: /home/jka/Android/Sdk/tools PATH: /usr/bin/site_perl
PATH: /home/jka/Android/Sdk/ndk/22.1.7171670 PATH: /usr/bin/vendor_perl
PATH: /usr/bin/core_perl
## ----------- ## ## ----------- ##
## Core tests. ## ## Core tests. ##
## ----------- ## ## ----------- ##
configure:2185: checking build system type configure:2057: loading site script /etc/config.site
configure:2199: result: x86_64-pc-linux-gnu | # This file is in public domain.
configure:2219: checking host system type | # Original author: Karlson2k (Evgeny Grin)
configure:2232: result: x86_64-pc-linux-gnu | # Written for MSys2 to help running 'configure' scripts
configure:2252: checking target system type |
configure:2265: result: x86_64-pc-linux-gnu | # Defaults for MSys2/MinGW64-targeted programs
configure:2341: checking for gcc |
configure:2357: found /usr/bin/gcc | # Set proper selfname on bash and fallback to default name on other shells
configure:2368: result: gcc | test -n "${BASH_SOURCE}" 2>/dev/null && config_site_me="${BASH_SOURCE[0]##*/}"
configure:2597: checking for C compiler version || config_site_me=config.site
configure:2606: gcc --version >&5 |
gcc (Ubuntu 10.2.0-13ubuntu1) 10.2.0 | # Set default 'host' to speedup configure
| if test -z "$build_alias"; then
| build_alias="${MSYSTEM_CHOST}" && \
| ${as_echo-echo} "$config_site_me:${as_lineno-$LINENO}: default build_alias
set to $build_alias" >&5
| fi
|
| # Set default 'prefix'
| if ( test -z "$prefix" || test "x$prefix" = "xNONE" ) && \
| ( test -z "$exec_prefix" || test "x$exec_prefix" = "xNONE" ); then
| prefix="${MSYSTEM_PREFIX}" && \
| ${as_echo-echo} "$config_site_me:${as_lineno-$LINENO}: default prefix set
to $prefix" >&5
| ficonfig.site:13: default build_alias set to x86_64-w64-mingw32
configure:2189: checking build system type
configure:2203: result: x86_64-w64-mingw32
configure:2223: checking host system type
configure:2236: result: x86_64-w64-mingw32
configure:2256: checking target system type
configure:2269: result: x86_64-w64-mingw32
configure:2345: checking for gcc
configure:2361: found /mingw64/bin/gcc
configure:2372: result: gcc
configure:2601: checking for C compiler version
configure:2610: gcc --version >&5
gcc.exe (Rev10, Built by MSYS2 project) 10.2.0
Copyright (C) 2020 Free Software Foundation, Inc. Copyright (C) 2020 Free Software Foundation, Inc.
This is free software; see the source for copying conditions. There is NO This is free software; see the source for copying conditions. There is NO
warranty; not even for MERCHANTABILITY or FITNESS FOR A PARTICULAR PURPOSE. warranty; not even for MERCHANTABILITY or FITNESS FOR A PARTICULAR PURPOSE.
configure:2617: $? = 0 configure:2621: $? = 0
configure:2606: gcc -v >&5 configure:2610: gcc -v >&5
Using built-in specs. Using built-in specs.
COLLECT_GCC=gcc COLLECT_GCC=C:\msys64\mingw64\bin\gcc.exe
COLLECT_LTO_WRAPPER=/usr/lib/gcc/x86_64-linux-gnu/10/lto-wrapper COLLECT_LTO_WRAPPER=C:/msys64/mingw64/bin/../lib/gcc/x86_64-w64-mingw32/10.2.0/l
OFFLOAD_TARGET_NAMES=nvptx-none:amdgcn-amdhsa:hsa to-wrapper.exe
OFFLOAD_TARGET_DEFAULT=1 Target: x86_64-w64-mingw32
Target: x86_64-linux-gnu Configured with: ../gcc-10.2.0/configure --prefix=/mingw64 --with-local-prefix=/
Configured with: ../src/configure -v --with-pkgversion='Ubuntu 10.2.0-13ubuntu1' mingw64/local --build=x86_64-w64-mingw32 --host=x86_64-w64-mingw32 --target=x86_
--with-bugurl=file:///usr/share/doc/gcc-10/README.Bugs --enable-languages=c,ada 64-w64-mingw32 --with-native-system-header-dir=/mingw64/x86_64-w64-mingw32/inclu
,c++,go,brig,d,fortran,objc,obj-c++,m2 --prefix=/usr --with-gcc-major-version-on de --libexecdir=/mingw64/lib --enable-bootstrap --with-arch=x86-64 --with-tune=g
ly --program-suffix=-10 --program-prefix=x86_64-linux-gnu- --enable-shared --ena eneric --enable-languages=c,lto,c++,fortran,ada,objc,obj-c++,jit --enable-shared
ble-linker-build-id --libexecdir=/usr/lib --without-included-gettext --enable-th --enable-static --enable-libatomic --enable-threads=posix --enable-graphite --e
reads=posix --libdir=/usr/lib --enable-nls --enable-clocale=gnu --enable-libstdc nable-fully-dynamic-string --enable-libstdcxx-filesystem-ts=yes --enable-libstdc
xx-debug --enable-libstdcxx-time=yes --with-default-libstdcxx-abi=new --enable-g xx-time=yes --disable-libstdcxx-pch --disable-libstdcxx-debug --disable-isl-vers
nu-unique-object --disable-vtable-verify --enable-plugin --enable-default-pie -- ion-check --enable-lto --enable-libgomp --disable-multilib --enable-checking=rel
with-system-zlib --enable-libphobos-checking=release --with-target-system-zlib=a ease --disable-rpath --disable-win32-registry --disable-nls --disable-werror --d
uto --enable-objc-gc=auto --enable-multiarch --disable-werror --with-arch-32=i68 isable-symvers --disable-plugin --with-libiconv --with-system-zlib --with-gmp=/m
6 --with-abi=m64 --with-multilib-list=m32,m64,mx32 --enable-multilib --with-tune ingw64 --with-mpfr=/mingw64 --with-mpc=/mingw64 --with-isl=/mingw64 --with-pkgve
=generic --enable-offload-targets=nvptx-none=/build/gcc-10-JvwpWM/gcc-10-10.2.0/ rsion='Rev10, Built by MSYS2 project' --with-bugurl=https://github.com/msys2/MIN
debian/tmp-nvptx/usr,amdgcn-amdhsa=/build/gcc-10-JvwpWM/gcc-10-10.2.0/debian/tmp GW-packages/issues --with-gnu-as --with-gnu-ld --with-boot-ldflags='-pipe -Wl,--
-gcn/usr,hsa --without-cuda-driver --enable-checking=release --build=x86_64-linu dynamicbase,--high-entropy-va,--nxcompat,--default-image-base-high -Wl,--disable
x-gnu --host=x86_64-linux-gnu --target=x86_64-linux-gnu -dynamicbase -static-libstdc++ -static-libgcc' 'LDFLAGS_FOR_TARGET=-pipe -Wl,--d
ynamicbase,--high-entropy-va,--nxcompat,--default-image-base-high' --enable-link
er-plugin-flags='LDFLAGS=-static-libstdc++\ -static-libgcc\ -pipe\ -Wl,--dynamic
base,--high-entropy-va,--nxcompat,--default-image-base-high\ -Wl,--stack,1258291
2'
Thread model: posix Thread model: posix
Supported LTO compression algorithms: zlib zstd Supported LTO compression algorithms: zlib zstd
gcc version 10.2.0 (Ubuntu 10.2.0-13ubuntu1) gcc version 10.2.0 (Rev10, Built by MSYS2 project)
... rest of stderr output deleted ... configure:2621: $? = 0
configure:2617: $? = 0 configure:2610: gcc -V >&5
configure:2606: gcc -V >&5 gcc.exe: error: unrecognized command-line option '-V'
gcc: error: unrecognized command-line option '-V' gcc.exe: fatal error: no input files
gcc: fatal error: no input files
compilation terminated. compilation terminated.
configure:2617: $? = 1 configure:2621: $? = 1
configure:2606: gcc -qversion >&5 configure:2610: gcc -qversion >&5
gcc: error: unrecognized command-line option '-qversion'; did you mean '--versio gcc.exe: error: unrecognized command-line option '-qversion'; did you mean '--ve
n'? rsion'?
gcc: fatal error: no input files gcc.exe: fatal error: no input files
compilation terminated. compilation terminated.
configure:2617: $? = 1 configure:2621: $? = 1
configure:2637: checking whether the C compiler works configure:2641: checking whether the C compiler works
configure:2659: gcc -m32 -m32 conftest.c >&5 configure:2663: gcc -static conftest.c >&5
configure:2663: $? = 0 configure:2667: $? = 0
configure:2711: result: yes configure:2715: result: yes
configure:2714: checking for C compiler default output file name configure:2718: checking for C compiler default output file name
configure:2716: result: a.out configure:2720: result: a.exe
configure:2722: checking for suffix of executables configure:2726: checking for suffix of executables
configure:2729: gcc -o conftest -m32 -m32 conftest.c >&5 configure:2733: gcc -o conftest.exe -static conftest.c >&5
configure:2733: $? = 0 configure:2737: $? = 0
configure:2755: result: configure:2759: result: .exe
configure:2777: checking whether we are cross compiling configure:2781: checking whether we are cross compiling
configure:2785: gcc -o conftest -m32 -m32 conftest.c >&5 configure:2789: gcc -o conftest.exe -static conftest.c >&5
configure:2789: $? = 0 configure:2793: $? = 0
configure:2796: ./conftest configure:2800: ./conftest.exe
configure:2800: $? = 0 configure:2804: $? = 0
configure:2788: result: no configure:2819: result: no
configure:2793: checking for suffix of object files configure:2824: checking for suffix of object files
configure:2815: gcc -c -m32 conftest.c >&5 configure:2846: gcc -c conftest.c >&5
configure:2819: $? = 0 configure:2850: $? = 0
configure:2840: result: o configure:2871: result: o
configure:2844: checking whether we are using the GNU C compiler configure:2875: checking whether we are using the GNU C compiler
configure:2863: gcc -c -m32 conftest.c >&5 configure:2894: gcc -c conftest.c >&5
configure:2863: $? = 0 configure:2894: $? = 0
configure:2872: result: yes configure:2903: result: yes
configure:2881: checking whether gcc accepts -g configure:2912: checking whether gcc accepts -g
configure:2901: gcc -c -g conftest.c >&5 configure:2932: gcc -c -g conftest.c >&5
configure:2901: $? = 0 configure:2932: $? = 0
configure:2942: result: yes configure:2973: result: yes
configure:2959: checking for gcc option to accept ISO C89 configure:2990: checking for gcc option to accept ISO C89
configure:3022: gcc -c -m32 conftest.c >&5 configure:3053: gcc -c -g -O2 conftest.c >&5
configure:3022: $? = 0 configure:3053: $? = 0
configure:3035: result: none needed configure:3066: result: none needed
configure:3069: checking for a BSD-compatible install configure:3100: checking for a BSD-compatible install
configure:3137: result: /usr/bin/install -c configure:3168: result: install -c
configure:3155: checking how to run the C preprocessor configure:3186: checking how to run the C preprocessor
configure:3186: gcc -E conftest.c configure:3217: gcc -E conftest.c
configure:3186: $? = 0 configure:3217: $? = 0
configure:3200: gcc -E conftest.c configure:3231: gcc -E conftest.c
conftest.c:9:10: fatal error: ac_nonexistent.h: No such file or directory conftest.c:9:10: fatal error: ac_nonexistent.h: No such file or directory
9 | #include <ac_nonexistent.h> 9 | #include <ac_nonexistent.h>
| ^~~~~~~~~~~~~~~~~~ | ^~~~~~~~~~~~~~~~~~
compilation terminated. compilation terminated.
configure:3200: $? = 1 configure:3231: $? = 1
configure: failed program was: configure: failed program was:
| /* confdefs.h */ | /* confdefs.h */
| #define PACKAGE_NAME "" | #define PACKAGE_NAME ""
| #define PACKAGE_TARNAME "" | #define PACKAGE_TARNAME ""
| #define PACKAGE_VERSION "" | #define PACKAGE_VERSION ""
| #define PACKAGE_STRING "" | #define PACKAGE_STRING ""
| #define PACKAGE_BUGREPORT "" | #define PACKAGE_BUGREPORT ""
| #define PACKAGE_URL "" | #define PACKAGE_URL ""
| /* end confdefs.h. */ | /* end confdefs.h. */
| #include <ac_nonexistent.h> | #include <ac_nonexistent.h>
configure:3225: result: gcc -E configure:3256: result: gcc -E
configure:3245: gcc -E conftest.c configure:3276: gcc -E conftest.c
configure:3245: $? = 0 configure:3276: $? = 0
configure:3259: gcc -E conftest.c configure:3290: gcc -E conftest.c
conftest.c:9:10: fatal error: ac_nonexistent.h: No such file or directory conftest.c:9:10: fatal error: ac_nonexistent.h: No such file or directory
9 | #include <ac_nonexistent.h> 9 | #include <ac_nonexistent.h>
| ^~~~~~~~~~~~~~~~~~ | ^~~~~~~~~~~~~~~~~~
compilation terminated. compilation terminated.
configure:3259: $? = 1 configure:3290: $? = 1
configure: failed program was: configure: failed program was:
| /* confdefs.h */ | /* confdefs.h */
| #define PACKAGE_NAME "" | #define PACKAGE_NAME ""
| #define PACKAGE_TARNAME "" | #define PACKAGE_TARNAME ""
| #define PACKAGE_VERSION "" | #define PACKAGE_VERSION ""
| #define PACKAGE_STRING "" | #define PACKAGE_STRING ""
| #define PACKAGE_BUGREPORT "" | #define PACKAGE_BUGREPORT ""
| #define PACKAGE_URL "" | #define PACKAGE_URL ""
| /* end confdefs.h. */ | /* end confdefs.h. */
| #include <ac_nonexistent.h> | #include <ac_nonexistent.h>
configure:3288: checking for grep that handles long lines and -e configure:3319: checking for grep that handles long lines and -e
configure:3346: result: /bin/grep configure:3377: result: /usr/bin/grep
configure:3351: checking for egrep configure:3382: checking for egrep
configure:3413: result: /bin/grep -E configure:3444: result: /usr/bin/grep -E
configure:3418: checking for ANSI C header files configure:3449: checking for ANSI C header files
configure:3438: gcc -c -m32 conftest.c >&5 configure:3469: gcc -c -g -O2 conftest.c >&5
configure:3438: $? = 0 configure:3469: $? = 0
configure:3511: gcc -o conftest -m32 -m32 conftest.c >&5 configure:3542: gcc -o conftest.exe -g -O2 -static conftest.c >&5
configure:3511: $? = 0 configure:3542: $? = 0
configure:3511: ./conftest configure:3542: ./conftest.exe
configure:3511: $? = 0 configure:3542: $? = 0
configure:3522: result: yes configure:3553: result: yes
configure:3535: checking for sys/types.h configure:3566: checking for sys/types.h
configure:3535: gcc -c -m32 conftest.c >&5 configure:3566: gcc -c -g -O2 conftest.c >&5
configure:3535: $? = 0 configure:3566: $? = 0
configure:3535: result: yes configure:3566: result: yes
configure:3535: checking for sys/stat.h configure:3566: checking for sys/stat.h
configure:3535: gcc -c -m32 conftest.c >&5 configure:3566: gcc -c -g -O2 conftest.c >&5
configure:3535: $? = 0 configure:3566: $? = 0
configure:3535: result: yes configure:3566: result: yes
configure:3535: checking for stdlib.h configure:3566: checking for stdlib.h
configure:3535: gcc -c -m32 conftest.c >&5 configure:3566: gcc -c -g -O2 conftest.c >&5
configure:3535: $? = 0 configure:3566: $? = 0
configure:3535: result: yes configure:3566: result: yes
configure:3535: checking for string.h configure:3566: checking for string.h
configure:3535: gcc -c -m32 conftest.c >&5 configure:3566: gcc -c -g -O2 conftest.c >&5
configure:3535: $? = 0 configure:3566: $? = 0
configure:3535: result: yes configure:3566: result: yes
configure:3535: checking for memory.h configure:3566: checking for memory.h
configure:3535: gcc -c -m32 conftest.c >&5 configure:3566: gcc -c -g -O2 conftest.c >&5
configure:3535: $? = 0 configure:3566: $? = 0
configure:3535: result: yes configure:3566: result: yes
configure:3535: checking for strings.h configure:3566: checking for strings.h
configure:3535: gcc -c -m32 conftest.c >&5 configure:3566: gcc -c -g -O2 conftest.c >&5
configure:3535: $? = 0 configure:3566: $? = 0
configure:3535: result: yes configure:3566: result: yes
configure:3535: checking for inttypes.h configure:3566: checking for inttypes.h
configure:3535: gcc -c -m32 conftest.c >&5 configure:3566: gcc -c -g -O2 conftest.c >&5
configure:3535: $? = 0 configure:3566: $? = 0
configure:3535: result: yes configure:3566: result: yes
configure:3535: checking for stdint.h configure:3566: checking for stdint.h
configure:3535: gcc -c -m32 conftest.c >&5 configure:3566: gcc -c -g -O2 conftest.c >&5
configure:3535: $? = 0 configure:3566: $? = 0
configure:3535: result: yes configure:3566: result: yes
configure:3535: checking for unistd.h configure:3566: checking for unistd.h
configure:3535: gcc -c -m32 conftest.c >&5 configure:3566: gcc -c -g -O2 conftest.c >&5
configure:3535: $? = 0 configure:3566: $? = 0
configure:3535: result: yes configure:3566: result: yes
configure:3548: checking minix/config.h usability configure:3579: checking minix/config.h usability
configure:3548: gcc -c -m32 conftest.c >&5 configure:3579: gcc -c -g -O2 conftest.c >&5
conftest.c:52:10: fatal error: minix/config.h: No such file or directory conftest.c:52:10: fatal error: minix/config.h: No such file or directory
52 | #include <minix/config.h> 52 | #include <minix/config.h>
| ^~~~~~~~~~~~~~~~ | ^~~~~~~~~~~~~~~~
compilation terminated. compilation terminated.
configure:3548: $? = 1 configure:3579: $? = 1
configure: failed program was: configure: failed program was:
| /* confdefs.h */ | /* confdefs.h */
| #define PACKAGE_NAME "" | #define PACKAGE_NAME ""
| #define PACKAGE_TARNAME "" | #define PACKAGE_TARNAME ""
| #define PACKAGE_VERSION "" | #define PACKAGE_VERSION ""
| #define PACKAGE_STRING "" | #define PACKAGE_STRING ""
| #define PACKAGE_BUGREPORT "" | #define PACKAGE_BUGREPORT ""
| #define PACKAGE_URL "" | #define PACKAGE_URL ""
| #define STDC_HEADERS 1 | #define STDC_HEADERS 1
| #define HAVE_SYS_TYPES_H 1 | #define HAVE_SYS_TYPES_H 1
skipping to change at line 268 skipping to change at line 285
| #ifdef HAVE_INTTYPES_H | #ifdef HAVE_INTTYPES_H
| # include <inttypes.h> | # include <inttypes.h>
| #endif | #endif
| #ifdef HAVE_STDINT_H | #ifdef HAVE_STDINT_H
| # include <stdint.h> | # include <stdint.h>
| #endif | #endif
| #ifdef HAVE_UNISTD_H | #ifdef HAVE_UNISTD_H
| # include <unistd.h> | # include <unistd.h>
| #endif | #endif
| #include <minix/config.h> | #include <minix/config.h>
configure:3548: result: no configure:3579: result: no
configure:3548: checking minix/config.h presence configure:3579: checking minix/config.h presence
configure:3548: gcc -E conftest.c configure:3579: gcc -E conftest.c
conftest.c:19:10: fatal error: minix/config.h: No such file or directory conftest.c:19:10: fatal error: minix/config.h: No such file or directory
19 | #include <minix/config.h> 19 | #include <minix/config.h>
| ^~~~~~~~~~~~~~~~ | ^~~~~~~~~~~~~~~~
compilation terminated. compilation terminated.
configure:3548: $? = 1 configure:3579: $? = 1
configure: failed program was: configure: failed program was:
| /* confdefs.h */ | /* confdefs.h */
| #define PACKAGE_NAME "" | #define PACKAGE_NAME ""
| #define PACKAGE_TARNAME "" | #define PACKAGE_TARNAME ""
| #define PACKAGE_VERSION "" | #define PACKAGE_VERSION ""
| #define PACKAGE_STRING "" | #define PACKAGE_STRING ""
| #define PACKAGE_BUGREPORT "" | #define PACKAGE_BUGREPORT ""
| #define PACKAGE_URL "" | #define PACKAGE_URL ""
| #define STDC_HEADERS 1 | #define STDC_HEADERS 1
| #define HAVE_SYS_TYPES_H 1 | #define HAVE_SYS_TYPES_H 1
| #define HAVE_SYS_STAT_H 1 | #define HAVE_SYS_STAT_H 1
| #define HAVE_STDLIB_H 1 | #define HAVE_STDLIB_H 1
| #define HAVE_STRING_H 1 | #define HAVE_STRING_H 1
| #define HAVE_MEMORY_H 1 | #define HAVE_MEMORY_H 1
| #define HAVE_STRINGS_H 1 | #define HAVE_STRINGS_H 1
| #define HAVE_INTTYPES_H 1 | #define HAVE_INTTYPES_H 1
| #define HAVE_STDINT_H 1 | #define HAVE_STDINT_H 1
| #define HAVE_UNISTD_H 1 | #define HAVE_UNISTD_H 1
| /* end confdefs.h. */ | /* end confdefs.h. */
| #include <minix/config.h> | #include <minix/config.h>
configure:3548: result: no configure:3579: result: no
configure:3548: checking for minix/config.h configure:3579: checking for minix/config.h
configure:3548: result: no configure:3579: result: no
configure:3569: checking whether it is safe to define __EXTENSIONS__ configure:3600: checking whether it is safe to define __EXTENSIONS__
configure:3587: gcc -c -m32 conftest.c >&5 configure:3618: gcc -c -g -O2 conftest.c >&5
configure:3587: $? = 0 configure:3618: $? = 0
configure:3594: result: yes configure:3625: result: yes
configure:3611: checking for library containing getmntent configure:3642: checking for library containing getmntent
configure:3642: gcc -o conftest -m32 -m32 conftest.c >&5 configure:3673: gcc -o conftest.exe -g -O2 -static conftest.c >&5
configure:3642: $? = 0 C:/msys64/mingw64/bin/../lib/gcc/x86_64-w64-mingw32/10.2.0/../../../../x86_64-w6
configure:3659: result: none required 4-mingw32/bin/ld.exe: C:\msys64\tmp\ccAjPVQw.o: in function `main':
configure:3673: checking for library containing strerror C:\msys64\home\jka\src\bed-3.1.1\regex-0.13/conftest.c:35: undefined reference t
configure:3704: gcc -o conftest -m32 -m32 conftest.c >&5 o `getmntent'
configure:3704: $? = 0 collect2.exe: error: ld returned 1 exit status
configure:3721: result: none required configure:3673: $? = 1
configure:3731: checking for ANSI C header files configure: failed program was:
configure:3835: result: yes | /* confdefs.h */
configure:3845: checking for string.h | #define PACKAGE_NAME ""
configure:3845: result: yes | #define PACKAGE_TARNAME ""
configure:3856: checking for size_t | #define PACKAGE_VERSION ""
configure:3856: gcc -c -m32 conftest.c >&5 | #define PACKAGE_STRING ""
configure:3856: $? = 0 | #define PACKAGE_BUGREPORT ""
configure:3856: gcc -c -m32 conftest.c >&5 | #define PACKAGE_URL ""
| #define STDC_HEADERS 1
| #define HAVE_SYS_TYPES_H 1
| #define HAVE_SYS_STAT_H 1
| #define HAVE_STDLIB_H 1
| #define HAVE_STRING_H 1
| #define HAVE_MEMORY_H 1
| #define HAVE_STRINGS_H 1
| #define HAVE_INTTYPES_H 1
| #define HAVE_STDINT_H 1
| #define HAVE_UNISTD_H 1
| #define __EXTENSIONS__ 1
| #define _ALL_SOURCE 1
| #define _GNU_SOURCE 1
| #define _POSIX_PTHREAD_SEMANTICS 1
| #define _TANDEM_SOURCE 1
| /* end confdefs.h. */
|
| /* Override any GCC internal prototype to avoid an error.
| Use char because int might match the return type of a GCC
| builtin and then its argument prototype would still apply. */
| #ifdef __cplusplus
| extern "C"
| #endif
| char getmntent ();
| int
| main ()
| {
| return getmntent ();
| ;
| return 0;
| }
configure:3673: gcc -o conftest.exe -g -O2 -static conftest.c -lsun >&5
C:/msys64/mingw64/bin/../lib/gcc/x86_64-w64-mingw32/10.2.0/../../../../x86_64-w6
4-mingw32/bin/ld.exe: cannot find -lsun
collect2.exe: error: ld returned 1 exit status
configure:3673: $? = 1
configure: failed program was:
| /* confdefs.h */
| #define PACKAGE_NAME ""
| #define PACKAGE_TARNAME ""
| #define PACKAGE_VERSION ""
| #define PACKAGE_STRING ""
| #define PACKAGE_BUGREPORT ""
| #define PACKAGE_URL ""
| #define STDC_HEADERS 1
| #define HAVE_SYS_TYPES_H 1
| #define HAVE_SYS_STAT_H 1
| #define HAVE_STDLIB_H 1
| #define HAVE_STRING_H 1
| #define HAVE_MEMORY_H 1
| #define HAVE_STRINGS_H 1
| #define HAVE_INTTYPES_H 1
| #define HAVE_STDINT_H 1
| #define HAVE_UNISTD_H 1
| #define __EXTENSIONS__ 1
| #define _ALL_SOURCE 1
| #define _GNU_SOURCE 1
| #define _POSIX_PTHREAD_SEMANTICS 1
| #define _TANDEM_SOURCE 1
| /* end confdefs.h. */
|
| /* Override any GCC internal prototype to avoid an error.
| Use char because int might match the return type of a GCC
| builtin and then its argument prototype would still apply. */
| #ifdef __cplusplus
| extern "C"
| #endif
| char getmntent ();
| int
| main ()
| {
| return getmntent ();
| ;
| return 0;
| }
configure:3673: gcc -o conftest.exe -g -O2 -static conftest.c -lseq >&5
C:/msys64/mingw64/bin/../lib/gcc/x86_64-w64-mingw32/10.2.0/../../../../x86_64-w6
4-mingw32/bin/ld.exe: cannot find -lseq
collect2.exe: error: ld returned 1 exit status
configure:3673: $? = 1
configure: failed program was:
| /* confdefs.h */
| #define PACKAGE_NAME ""
| #define PACKAGE_TARNAME ""
| #define PACKAGE_VERSION ""
| #define PACKAGE_STRING ""
| #define PACKAGE_BUGREPORT ""
| #define PACKAGE_URL ""
| #define STDC_HEADERS 1
| #define HAVE_SYS_TYPES_H 1
| #define HAVE_SYS_STAT_H 1
| #define HAVE_STDLIB_H 1
| #define HAVE_STRING_H 1
| #define HAVE_MEMORY_H 1
| #define HAVE_STRINGS_H 1
| #define HAVE_INTTYPES_H 1
| #define HAVE_STDINT_H 1
| #define HAVE_UNISTD_H 1
| #define __EXTENSIONS__ 1
| #define _ALL_SOURCE 1
| #define _GNU_SOURCE 1
| #define _POSIX_PTHREAD_SEMANTICS 1
| #define _TANDEM_SOURCE 1
| /* end confdefs.h. */
|
| /* Override any GCC internal prototype to avoid an error.
| Use char because int might match the return type of a GCC
| builtin and then its argument prototype would still apply. */
| #ifdef __cplusplus
| extern "C"
| #endif
| char getmntent ();
| int
| main ()
| {
| return getmntent ();
| ;
| return 0;
| }
configure:3673: gcc -o conftest.exe -g -O2 -static conftest.c -lgen >&5
C:/msys64/mingw64/bin/../lib/gcc/x86_64-w64-mingw32/10.2.0/../../../../x86_64-w6
4-mingw32/bin/ld.exe: cannot find -lgen
collect2.exe: error: ld returned 1 exit status
configure:3673: $? = 1
configure: failed program was:
| /* confdefs.h */
| #define PACKAGE_NAME ""
| #define PACKAGE_TARNAME ""
| #define PACKAGE_VERSION ""
| #define PACKAGE_STRING ""
| #define PACKAGE_BUGREPORT ""
| #define PACKAGE_URL ""
| #define STDC_HEADERS 1
| #define HAVE_SYS_TYPES_H 1
| #define HAVE_SYS_STAT_H 1
| #define HAVE_STDLIB_H 1
| #define HAVE_STRING_H 1
| #define HAVE_MEMORY_H 1
| #define HAVE_STRINGS_H 1
| #define HAVE_INTTYPES_H 1
| #define HAVE_STDINT_H 1
| #define HAVE_UNISTD_H 1
| #define __EXTENSIONS__ 1
| #define _ALL_SOURCE 1
| #define _GNU_SOURCE 1
| #define _POSIX_PTHREAD_SEMANTICS 1
| #define _TANDEM_SOURCE 1
| /* end confdefs.h. */
|
| /* Override any GCC internal prototype to avoid an error.
| Use char because int might match the return type of a GCC
| builtin and then its argument prototype would still apply. */
| #ifdef __cplusplus
| extern "C"
| #endif
| char getmntent ();
| int
| main ()
| {
| return getmntent ();
| ;
| return 0;
| }
configure:3690: result: no
configure:3704: checking for library containing strerror
configure:3735: gcc -o conftest.exe -g -O2 -static conftest.c >&5
configure:3735: $? = 0
configure:3752: result: none required
configure:3762: checking for ANSI C header files
configure:3866: result: yes
configure:3876: checking for string.h
configure:3876: result: yes
configure:3887: checking for size_t
configure:3887: gcc -c -g -O2 conftest.c >&5
configure:3887: $? = 0
configure:3887: gcc -c -g -O2 conftest.c >&5
conftest.c: In function 'main': conftest.c: In function 'main':
conftest.c:63:21: error: expected expression before ')' token conftest.c:62:21: error: expected expression before ')' token
63 | if (sizeof ((size_t))) 62 | if (sizeof ((size_t)))
| ^ | ^
configure:3856: $? = 1 configure:3887: $? = 1
configure: failed program was: configure: failed program was:
| /* confdefs.h */ | /* confdefs.h */
| #define PACKAGE_NAME "" | #define PACKAGE_NAME ""
| #define PACKAGE_TARNAME "" | #define PACKAGE_TARNAME ""
| #define PACKAGE_VERSION "" | #define PACKAGE_VERSION ""
| #define PACKAGE_STRING "" | #define PACKAGE_STRING ""
| #define PACKAGE_BUGREPORT "" | #define PACKAGE_BUGREPORT ""
| #define PACKAGE_URL "" | #define PACKAGE_URL ""
| #define STDC_HEADERS 1 | #define STDC_HEADERS 1
| #define HAVE_SYS_TYPES_H 1 | #define HAVE_SYS_TYPES_H 1
skipping to change at line 347 skipping to change at line 535
| #define HAVE_MEMORY_H 1 | #define HAVE_MEMORY_H 1
| #define HAVE_STRINGS_H 1 | #define HAVE_STRINGS_H 1
| #define HAVE_INTTYPES_H 1 | #define HAVE_INTTYPES_H 1
| #define HAVE_STDINT_H 1 | #define HAVE_STDINT_H 1
| #define HAVE_UNISTD_H 1 | #define HAVE_UNISTD_H 1
| #define __EXTENSIONS__ 1 | #define __EXTENSIONS__ 1
| #define _ALL_SOURCE 1 | #define _ALL_SOURCE 1
| #define _GNU_SOURCE 1 | #define _GNU_SOURCE 1
| #define _POSIX_PTHREAD_SEMANTICS 1 | #define _POSIX_PTHREAD_SEMANTICS 1
| #define _TANDEM_SOURCE 1 | #define _TANDEM_SOURCE 1
| #define HAVE_GETMNTENT 1
| #define STDC_HEADERS 1 | #define STDC_HEADERS 1
| #define HAVE_STRING_H 1 | #define HAVE_STRING_H 1
| /* end confdefs.h. */ | /* end confdefs.h. */
| #include <stdio.h> | #include <stdio.h>
| #ifdef HAVE_SYS_TYPES_H | #ifdef HAVE_SYS_TYPES_H
| # include <sys/types.h> | # include <sys/types.h>
| #endif | #endif
| #ifdef HAVE_SYS_STAT_H | #ifdef HAVE_SYS_STAT_H
| # include <sys/stat.h> | # include <sys/stat.h>
| #endif | #endif
skipping to change at line 392 skipping to change at line 579
| # include <unistd.h> | # include <unistd.h>
| #endif | #endif
| int | int
| main () | main ()
| { | {
| if (sizeof ((size_t))) | if (sizeof ((size_t)))
| return 0; | return 0;
| ; | ;
| return 0; | return 0;
| } | }
configure:3856: result: yes configure:3887: result: yes
configure:3869: checking for working alloca.h configure:3900: checking for working alloca.h
configure:3886: gcc -o conftest -m32 -m32 conftest.c >&5 configure:3917: gcc -o conftest.exe -g -O2 -static conftest.c >&5
configure:3886: $? = 0 conftest.c:26:10: fatal error: alloca.h: No such file or directory
configure:3894: result: yes 26 | #include <alloca.h>
configure:3902: checking for alloca | ^~~~~~~~~~
configure:3939: gcc -o conftest -m32 -m32 conftest.c >&5 compilation terminated.
configure:3939: $? = 0 configure:3917: $? = 1
configure:3947: result: yes configure: failed program was:
configure:4053: checking for an ANSI C-conforming const | /* confdefs.h */
configure:4119: gcc -c -m32 conftest.c >&5 | #define PACKAGE_NAME ""
configure:4119: $? = 0 | #define PACKAGE_TARNAME ""
configure:4126: result: yes | #define PACKAGE_VERSION ""
configure:4388: creating ./config.status | #define PACKAGE_STRING ""
| #define PACKAGE_BUGREPORT ""
| #define PACKAGE_URL ""
| #define STDC_HEADERS 1
| #define HAVE_SYS_TYPES_H 1
| #define HAVE_SYS_STAT_H 1
| #define HAVE_STDLIB_H 1
| #define HAVE_STRING_H 1
| #define HAVE_MEMORY_H 1
| #define HAVE_STRINGS_H 1
| #define HAVE_INTTYPES_H 1
| #define HAVE_STDINT_H 1
| #define HAVE_UNISTD_H 1
| #define __EXTENSIONS__ 1
| #define _ALL_SOURCE 1
| #define _GNU_SOURCE 1
| #define _POSIX_PTHREAD_SEMANTICS 1
| #define _TANDEM_SOURCE 1
| #define STDC_HEADERS 1
| #define HAVE_STRING_H 1
| /* end confdefs.h. */
| #include <alloca.h>
| int
| main ()
| {
| char *p = (char *) alloca (2 * sizeof (int));
| if (p) return 0;
| ;
| return 0;
| }
configure:3925: result: no
configure:3933: checking for alloca
configure:3970: gcc -o conftest.exe -g -O2 -static conftest.c >&5
configure:3970: $? = 0
configure:3978: result: yes
configure:4084: checking for an ANSI C-conforming const
configure:4150: gcc -c -g -O2 conftest.c >&5
configure:4150: $? = 0
configure:4157: result: yes
configure:4419: creating ./config.status
## ---------------------- ## ## ---------------------- ##
## Running config.status. ## ## Running config.status. ##
## ---------------------- ## ## ---------------------- ##
This file was extended by config.status, which was This file was extended by config.status, which was
generated by GNU Autoconf 2.69. Invocation command line was generated by GNU Autoconf 2.69. Invocation command line was
CONFIG_FILES = CONFIG_FILES =
CONFIG_HEADERS = CONFIG_HEADERS =
CONFIG_LINKS = CONFIG_LINKS =
CONFIG_COMMANDS = CONFIG_COMMANDS =
$ ./config.status $ ./config.status
on i7 on DESKTOP-442N72S
config.status:738: creating Makefile config.status:742: creating Makefile
## ---------------- ## ## ---------------- ##
## Cache variables. ## ## Cache variables. ##
## ---------------- ## ## ---------------- ##
ac_cv_build=x86_64-pc-linux-gnu ac_cv_build=x86_64-w64-mingw32
ac_cv_c_compiler_gnu=yes ac_cv_c_compiler_gnu=yes
ac_cv_c_const=yes ac_cv_c_const=yes
ac_cv_env_CC_set= ac_cv_env_CC_set=
ac_cv_env_CC_value= ac_cv_env_CC_value=
ac_cv_env_CFLAGS_set=set ac_cv_env_CFLAGS_set=
ac_cv_env_CFLAGS_value=-m32 ac_cv_env_CFLAGS_value=
ac_cv_env_CPPFLAGS_set= ac_cv_env_CPPFLAGS_set=
ac_cv_env_CPPFLAGS_value= ac_cv_env_CPPFLAGS_value=
ac_cv_env_CPP_set= ac_cv_env_CPP_set=
ac_cv_env_CPP_value= ac_cv_env_CPP_value=
ac_cv_env_LDFLAGS_set=set ac_cv_env_LDFLAGS_set=
ac_cv_env_LDFLAGS_value=-m32 ac_cv_env_LDFLAGS_value=
ac_cv_env_LIBS_set= ac_cv_env_LIBS_set=
ac_cv_env_LIBS_value= ac_cv_env_LIBS_value=
ac_cv_env_build_alias_set= ac_cv_env_build_alias_set=
ac_cv_env_build_alias_value= ac_cv_env_build_alias_value=
ac_cv_env_host_alias_set= ac_cv_env_host_alias_set=
ac_cv_env_host_alias_value= ac_cv_env_host_alias_value=
ac_cv_env_target_alias_set= ac_cv_env_target_alias_set=
ac_cv_env_target_alias_value= ac_cv_env_target_alias_value=
ac_cv_exeext=.exe
ac_cv_func_alloca_works=yes ac_cv_func_alloca_works=yes
ac_cv_func_getmntent=yes ac_cv_func_getmntent=no
ac_cv_header_inttypes_h=yes ac_cv_header_inttypes_h=yes
ac_cv_header_memory_h=yes ac_cv_header_memory_h=yes
ac_cv_header_minix_config_h=no ac_cv_header_minix_config_h=no
ac_cv_header_stdc=yes ac_cv_header_stdc=yes
ac_cv_header_stdint_h=yes ac_cv_header_stdint_h=yes
ac_cv_header_stdlib_h=yes ac_cv_header_stdlib_h=yes
ac_cv_header_string_h=yes ac_cv_header_string_h=yes
ac_cv_header_strings_h=yes ac_cv_header_strings_h=yes
ac_cv_header_sys_stat_h=yes ac_cv_header_sys_stat_h=yes
ac_cv_header_sys_types_h=yes ac_cv_header_sys_types_h=yes
ac_cv_header_unistd_h=yes ac_cv_header_unistd_h=yes
ac_cv_host=x86_64-pc-linux-gnu ac_cv_host=x86_64-w64-mingw32
ac_cv_objext=o ac_cv_objext=o
ac_cv_path_EGREP='/bin/grep -E' ac_cv_path_EGREP='/usr/bin/grep -E'
ac_cv_path_GREP=/bin/grep ac_cv_path_GREP=/usr/bin/grep
ac_cv_path_install='/usr/bin/install -c'
ac_cv_prog_CPP='gcc -E' ac_cv_prog_CPP='gcc -E'
ac_cv_prog_ac_ct_CC=gcc ac_cv_prog_ac_ct_CC=gcc
ac_cv_prog_cc_c89= ac_cv_prog_cc_c89=
ac_cv_prog_cc_g=yes ac_cv_prog_cc_g=yes
ac_cv_safe_to_define___extensions__=yes ac_cv_safe_to_define___extensions__=yes
ac_cv_search_getmntent='none required' ac_cv_search_getmntent=no
ac_cv_search_strerror='none required' ac_cv_search_strerror='none required'
ac_cv_target=x86_64-pc-linux-gnu ac_cv_target=x86_64-w64-mingw32
ac_cv_type_size_t=yes ac_cv_type_size_t=yes
ac_cv_working_alloca_h=yes ac_cv_working_alloca_h=no
## ----------------- ## ## ----------------- ##
## Output variables. ## ## Output variables. ##
## ----------------- ## ## ----------------- ##
ALLOCA='' ALLOCA=''
CC='gcc' CC='gcc'
CFLAGS='-m32' CFLAGS='-g -O2'
CPP='gcc -E' CPP='gcc -E'
CPPFLAGS='' CPPFLAGS=''
DEFS='-DPACKAGE_NAME=\"\" -DPACKAGE_TARNAME=\"\" -DPACKAGE_VERSION=\"\" -DPACKAG E_STRING=\"\" -DPACKAGE_BUGREPORT=\"\" -DPACKAGE_URL=\"\" -DSTDC_HEADERS=1 -DHAV E_SYS_TYPES_H=1 -DHAVE_SYS_STAT_H=1 -DHAVE_STDLIB_H=1 -DHAVE_STRING_H=1 -DHAVE_M EMORY_H=1 -DHAVE_STRINGS_H=1 -DHAVE_INTTYPES_H=1 -DHAVE_STDINT_H=1 -DHAVE_UNISTD _H=1 -D__EXTENSIONS__=1 -D_ALL_SOURCE=1 -D_GNU_SOURCE=1 -D_POSIX_PTHREAD_SEMANTI CS=1 -D_TANDEM_SOURCE=1 -DHAVE_GETMNTENT=1 -DSTDC_HEADERS=1 -DHAVE_STRING_H=1 -D HAVE_ALLOCA_H=1 -DHAVE_ALLOCA=1' DEFS='-DPACKAGE_NAME=\"\" -DPACKAGE_TARNAME=\"\" -DPACKAGE_VERSION=\"\" -DPACKAG E_STRING=\"\" -DPACKAGE_BUGREPORT=\"\" -DPACKAGE_URL=\"\" -DSTDC_HEADERS=1 -DHAV E_SYS_TYPES_H=1 -DHAVE_SYS_STAT_H=1 -DHAVE_STDLIB_H=1 -DHAVE_STRING_H=1 -DHAVE_M EMORY_H=1 -DHAVE_STRINGS_H=1 -DHAVE_INTTYPES_H=1 -DHAVE_STDINT_H=1 -DHAVE_UNISTD _H=1 -D__EXTENSIONS__=1 -D_ALL_SOURCE=1 -D_GNU_SOURCE=1 -D_POSIX_PTHREAD_SEMANTI CS=1 -D_TANDEM_SOURCE=1 -DSTDC_HEADERS=1 -DHAVE_STRING_H=1 -DHAVE_ALLOCA=1'
ECHO_C='' ECHO_C=''
ECHO_N='-n' ECHO_N='-n'
ECHO_T='' ECHO_T=''
EGREP='/bin/grep -E' EGREP='/usr/bin/grep -E'
EXEEXT='' EXEEXT='.exe'
GREP='/bin/grep' GREP='/usr/bin/grep'
INSTALL_DATA='${INSTALL} -m 644' INSTALL_DATA='${INSTALL} -m 644'
INSTALL_PROGRAM='${INSTALL}' INSTALL_PROGRAM='${INSTALL}'
INSTALL_SCRIPT='${INSTALL}' INSTALL_SCRIPT='${INSTALL}'
LDFLAGS='-m32' LDFLAGS='-static'
LIBOBJS='' LIBOBJS=''
LIBS='' LIBS=''
LTLIBOBJS='' LTLIBOBJS=''
OBJEXT='o' OBJEXT='o'
PACKAGE_BUGREPORT='' PACKAGE_BUGREPORT=''
PACKAGE_NAME='' PACKAGE_NAME=''
PACKAGE_STRING='' PACKAGE_STRING=''
PACKAGE_TARNAME='' PACKAGE_TARNAME=''
PACKAGE_URL='' PACKAGE_URL=''
PACKAGE_VERSION='' PACKAGE_VERSION=''
PATH_SEPARATOR=':' PATH_SEPARATOR=':'
SHELL='/bin/sh' SHELL='/bin/sh'
ac_ct_CC='gcc' ac_ct_CC='gcc'
ac_prefix_program='' ac_prefix_program=''
bindir='${exec_prefix}/bin' bindir='${exec_prefix}/bin'
build='x86_64-pc-linux-gnu' build='x86_64-w64-mingw32'
build_alias='' build_alias='x86_64-w64-mingw32'
build_cpu='x86_64' build_cpu='x86_64'
build_os='linux-gnu' build_os='mingw32'
build_vendor='pc' build_vendor='w64'
datadir='${datarootdir}' datadir='${datarootdir}'
datarootdir='${prefix}/share' datarootdir='${prefix}/share'
docdir='${datarootdir}/doc/${PACKAGE}' docdir='${datarootdir}/doc/${PACKAGE}'
dvidir='${docdir}' dvidir='${docdir}'
exec_prefix='${prefix}' exec_prefix='${prefix}'
host='x86_64-pc-linux-gnu' host='x86_64-w64-mingw32'
host_alias='' host_alias=''
host_cpu='x86_64' host_cpu='x86_64'
host_os='linux-gnu' host_os='mingw32'
host_vendor='pc' host_vendor='w64'
htmldir='${docdir}' htmldir='${docdir}'
includedir='${prefix}/include' includedir='${prefix}/include'
infodir='${datarootdir}/info' infodir='${datarootdir}/info'
libdir='${exec_prefix}/lib' libdir='${exec_prefix}/lib'
libexecdir='${exec_prefix}/libexec' libexecdir='${exec_prefix}/libexec'
localedir='${datarootdir}/locale' localedir='${datarootdir}/locale'
localstatedir='${prefix}/var' localstatedir='${prefix}/var'
mandir='${datarootdir}/man' mandir='${datarootdir}/man'
oldincludedir='/usr/include' oldincludedir='/usr/include'
pdfdir='${docdir}' pdfdir='${docdir}'
prefix='/usr/local' prefix='/mingw64'
program_transform_name='s,x,x,' program_transform_name='s,x,x,'
psdir='${docdir}' psdir='${docdir}'
sbindir='${exec_prefix}/sbin' sbindir='${exec_prefix}/sbin'
sharedstatedir='${prefix}/com' sharedstatedir='${prefix}/com'
sysconfdir='${prefix}/etc' sysconfdir='${prefix}/etc'
target='x86_64-pc-linux-gnu' target='x86_64-w64-mingw32'
target_alias='' target_alias=''
target_cpu='x86_64' target_cpu='x86_64'
target_os='linux-gnu' target_os='mingw32'
target_vendor='pc' target_vendor='w64'
## ----------- ## ## ----------- ##
## confdefs.h. ## ## confdefs.h. ##
## ----------- ## ## ----------- ##
/* confdefs.h */ /* confdefs.h */
#define PACKAGE_NAME "" #define PACKAGE_NAME ""
#define PACKAGE_TARNAME "" #define PACKAGE_TARNAME ""
#define PACKAGE_VERSION "" #define PACKAGE_VERSION ""
#define PACKAGE_STRING "" #define PACKAGE_STRING ""
skipping to change at line 576 skipping to change at line 802
#define HAVE_MEMORY_H 1 #define HAVE_MEMORY_H 1
#define HAVE_STRINGS_H 1 #define HAVE_STRINGS_H 1
#define HAVE_INTTYPES_H 1 #define HAVE_INTTYPES_H 1
#define HAVE_STDINT_H 1 #define HAVE_STDINT_H 1
#define HAVE_UNISTD_H 1 #define HAVE_UNISTD_H 1
#define __EXTENSIONS__ 1 #define __EXTENSIONS__ 1
#define _ALL_SOURCE 1 #define _ALL_SOURCE 1
#define _GNU_SOURCE 1 #define _GNU_SOURCE 1
#define _POSIX_PTHREAD_SEMANTICS 1 #define _POSIX_PTHREAD_SEMANTICS 1
#define _TANDEM_SOURCE 1 #define _TANDEM_SOURCE 1
#define HAVE_GETMNTENT 1
#define STDC_HEADERS 1 #define STDC_HEADERS 1
#define HAVE_STRING_H 1 #define HAVE_STRING_H 1
#define HAVE_ALLOCA_H 1
#define HAVE_ALLOCA 1 #define HAVE_ALLOCA 1
configure: exit 0 configure: exit 0
 End of changes. 51 change blocks. 
238 lines changed or deleted 474 lines changed or added

Home  |  About  |  Features  |  All  |  Newest  |  Dox  |  Diffs  |  RSS Feeds  |  Screenshots  |  Comments  |  Imprint  |  Privacy  |  HTTP(S)